program: Gaussian 09
title: 000245304
version: EM64L-G09RevD.01
frameworkgroup: C1[X(C10H10N2O5)]
method: RPBEPBE
basis: SDD
operation: Freq
keyword: #p
keyword: freq=noraman
keyword: PBEPBE/SDD
title: #p freq=noraman PBEPBE/SDD
converged: YES YES NO NO
title: Mulliken charges:
elementType: O O O O O N N C C C C C C C C C C H H H H H H H H H H
charge: -0.208574 -0.202920 -0.169254 -0.216775 -0.226078 0.013190 0.098214 0.252129 0.238096 0.543647 -0.507921 -0.319181 -0.392317 -0.256228 -0.267675 -0.672363 -0.196939 0.292516 0.263277 0.236018 0.221523 0.222990 0.285958 0.212739 0.246000 0.240015 0.269914
chargesum: 0.00000
title: Mulliken charges with hydrogens summed into heavy atoms:
elementType: O O O O O N N C C C C C C C C C C
charge: -0.208574 -0.202920 -0.169254 -0.216775 -0.226078 0.013190 0.098214 0.252129 0.238096 0.543647 -0.215405 -0.055904 -0.156299 0.188285 0.018282 0.026391 0.072976
polarizability: 3.14450352e+02 5.51909980e+00 1.61460854e+02 -4.40846049e+00 3.68951246e+00 6.73830619e+01
1716.lowfreq: -0.0008 -0.0004 0.0003 2.2206 4.5556 6.6167 36.6377 38.7364 42.7202
frequency: 36.6344 38.7017 42.7084 68.6671 87.7165 102.6169 121.0461 139.6857 148.9888 198.7385 218.1048 225.4251 243.1691 294.8153 321.5924 367.6187 375.6886 402.4136 443.2314 516.1161 534.3270 565.9388 605.7905 653.5808 660.4389 682.3209 701.7393 749.0016 753.7866 774.6657 812.9555 836.9701 849.9379 889.7212 924.1411 929.2769 937.9030 962.0902 1005.9396 1018.0061 1066.3215 1116.5064 1129.5162 1166.2083 1192.9453 1209.2347 1220.1711 1245.4814 1263.1310 1265.2847 1291.9673 1298.6781 1359.9103 1365.8020 1378.9937 1384.9803 1405.5887 1434.7110 1460.5603 1471.8784 1483.4565 1502.3976 1552.8318 1620.8673 1636.7075 2973.8102 3004.1560 3040.5425 3101.4727 3117.7719 3122.1848 3149.4691 3164.8257 3179.5077 3199.9034
redmass: 9.2211 6.6741 7.4927 7.1716 5.2476 2.1535 4.9142 3.0517 3.6200 8.2208 7.4927 2.5180 1.5319 6.5576 5.0131 5.0451 4.4572 5.5486 4.1831 5.4055 3.8961 5.8174 5.2984 7.1995 7.2604 8.5097 7.2960 4.0191 5.0857 7.1629 1.3351 1.2154 1.7650 4.0681 4.4438 1.5108 5.9028 1.3761 1.2723 2.4398 3.0535 2.2539 1.4203 1.5702 2.7179 6.6274 2.0001 1.6573 3.6296 1.1713 1.5268 2.4422 2.4344 1.8349 5.6896 4.2660 1.2550 5.4383 1.0384 1.1459 1.1043 2.3563 7.0217 6.4544 5.8399 1.0553 1.0369 1.1085 1.0988 1.1019 1.0896 1.0893 1.0922 1.0948 1.0952
irintensity: 1.5164 0.6537 0.1581 3.0764 3.5786 1.8808 1.5171 1.1785 0.8370 2.5538 0.1996 0.2260 1.1990 1.3113 1.0445 1.2973 1.2573 3.9811 0.4746 3.0927 12.1178 30.3131 21.7225 7.2954 2.7962 7.9391 2.9588 5.6992 7.0226 7.4568 43.8815 7.1609 27.9851 54.8158 15.9335 3.8850 39.0546 1.0715 53.1162 95.1988 48.8232 0.8116 6.3368 194.1299 395.3145 266.4846 314.5815 20.1274 192.5512 6.6134 1.7862 4.4527 12.2666 10.6048 204.6401 82.7126 48.0348 20.8808 13.7023 62.6692 23.6364 97.7272 14.9869 329.9009 110.3989 28.2349 18.5555 24.0232 20.7171 24.5338 0.5250 4.3239 2.8973 7.6486 12.4345
temp: 298.150 k
press: 1.00000 atm
elementType: 8 8 8 8 8 7 7 6 6 6 6 6 6 6 6 6 6 1 1 1 1 1 1 1 1 1 1
symmnumber: 1
zpe: 507336.2 jmol-1
zpe.correction: 0.193234 hartree
zpe.thermalcorrener: 0.209433 hartree
zpe.thermalcorrenthalpy: 0.210377 hartree
zpe.thermalcorrgfe: 0.147388 hartree
zpe.sumelectzpe: -871.241374 hartree
zpe.sumelectthermal: -871.225175 hartree
zpe.sumelectthermalent: -871.224231 hartree
zpe.sumelectthermalfe: -871.287220 hartree
dipole: 5.7071 -6.7133 0.0655
dipole: 8.8115
quadrupole: -134.7154 -98.9846 -98.7420
quadrupole: -18.8970 2.1511 -1.1239
quadrupole: -23.9014 11.8294 12.0721 -18.8970 2.1511 -1.1239
hfenergy: -871.4346082 hartree
pointgroup: C01 [X(C10H10N2O5)]
dipole: 2.2216875 2.6536173 -0.2015508 debye
polarizability: 314.514945|-4.3205162|161.5390619|-4.6037725|0.5604239|67.2402609 unknown
InChI: InChI=1S/C10H10N2O5/c1-2-17-10-4-3-8(5-6-11(13)14)7-9(10)12(15)16/h3-7H,2H2,1H3
charge 0 multiplicity 1
27 atoms
O  3.156183 0.546622 -0.213507
O  1.560075 -3.211998 -0.487184
O  3.259453 -2.051715 0.497613
O  -5.772855 1.166076 0.144094
O  -5.175817 -1.047115 0.147898
N  2.082835 -2.123897 -0.01733
N  -4.88946 0.215325 0.125206
C  1.792108 0.410726 -0.111797
C  1.235239 -0.906662 -0.048343
C  -1.056553 -0.008733 -0.00341
C  -0.155715 -1.104213 -0.013614
C  0.882199 1.509999 -0.107938
C  -0.501034 1.305382 -0.047351
C  3.746084 1.911413 -0.333509
C  -2.490467 -0.283944 0.049147
C  5.252977 1.714364 -0.445939
C  -3.494219 0.639154 0.073372
H  -0.525302 -2.13455 0.004648
H  1.267681 2.53138 -0.155736
H  -1.160567 2.179428 -0.041208
H  3.326688 2.405642 -1.232145
H  3.475766 2.495299 0.568146
H  -2.802998 -1.337123 0.071078
H  5.75276 2.696939 -0.521844
H  5.643438 1.187925 0.440393
H  5.505579 1.121925 -1.34083
H  -3.396379 1.725353 0.059292
