program: Gaussian 09
title: 000245282
version: EM64L-G09RevD.01
frameworkgroup: C1[X(C11H12N4O)]
method: RPBEPBE
basis: SDD
operation: Freq
keyword: #p
keyword: freq=noraman
keyword: PBEPBE/SDD
title: #p freq=noraman PBEPBE/SDD
converged: YES YES NO NO
title: Mulliken charges:
elementType: O N N N N C C C C C C C C C C C H H H H H H H H H H H H
charge: -0.249660 -0.458789 -0.450825 -0.111455 -0.659587 0.432373 0.277407 0.456493 -0.320806 -0.458539 -0.363270 -0.410229 -0.511863 0.449715 -0.811602 0.011754 0.298355 0.338720 0.210175 0.229157 0.227221 0.220115 0.219329 0.229968 0.229780 0.322157 0.331915 0.321989
chargesum: 0.00000
title: Mulliken charges with hydrogens summed into heavy atoms:
elementType: O N N N N C C C C C C C C C C C
charge: -0.249660 -0.160434 -0.128668 -0.111455 -0.005683 0.432373 0.277407 0.456493 0.017914 -0.248363 -0.134113 -0.183009 -0.291747 0.449715 -0.132525 0.011754
polarizability: 2.85568985e+02 -2.74486273e+00 1.65357143e+02 7.51833471e-03 1.08328678e-02 6.55595253e+01
1716.lowfreq: -30.8493 0.0007 0.0009 0.0010 3.2098 7.9794 12.8264 43.0753 51.5154
frequency: -29.8683 42.9697 51.3342 90.7890 123.1168 147.2848 206.0568 212.1467 226.5438 249.3345 254.9424 338.3327 341.1022 353.7381 411.5296 421.0229 500.6062 510.9475 512.7888 524.5821 585.1623 599.6923 604.0167 633.8772 646.7602 673.9687 717.9733 718.9829 736.7118 758.0138 768.2726 816.4821 834.8590 863.8968 905.3902 937.8070 972.7440 986.5072 1008.3819 1009.0915 1028.4244 1046.7767 1063.1139 1122.9166 1171.8200 1187.5285 1196.5732 1222.2980 1266.4188 1300.0133 1317.0587 1353.2805 1393.8774 1398.4108 1420.7801 1458.8628 1469.4388 1475.6223 1507.3970 1532.8403 1556.9061 1599.6659 1623.9193 1632.7383 1638.8299 1661.1376 2973.4332 3050.6231 3079.4108 3095.7147 3123.0798 3133.1735 3163.2843 3183.3076 3528.9164 3538.8210 3562.8868 3703.8510
redmass: 1.0411 4.7403 4.1543 5.5273 3.9457 5.2266 4.3840 4.9126 4.7084 5.2668 1.1378 4.3569 3.5028 2.8514 2.9738 1.1880 6.4010 6.5860 2.2744 5.5175 1.5362 7.6354 1.2912 6.8223 3.0227 1.9514 6.0638 2.9554 5.1190 4.4796 3.0299 1.4909 5.8519 1.2832 6.4643 1.3567 3.1960 1.4509 1.3000 2.9756 3.3384 1.5377 1.5834 1.3568 4.5394 1.3469 1.4507 2.5556 2.3518 1.6841 1.5196 2.7216 2.6049 1.6338 3.2490 3.3915 1.0459 1.1397 2.6655 3.4773 4.0998 3.4601 3.7563 2.1995 3.0126 3.5148 1.0370 1.0976 1.0986 1.0882 1.0909 1.0953 1.0933 1.0951 1.0779 1.0755 1.0459 1.1044
irintensity: 0.9714 6.5239 0.6349 5.5126 0.4213 0.0632 0.1213 0.0866 0.6448 0.9440 51.9604 2.2216 0.8382 2.0889 0.0982 241.6183 0.0328 1.1974 34.9674 2.2098 3.8007 12.3325 59.1240 1.1840 33.5929 65.9230 1.0948 0.3567 7.1189 1.1724 115.7506 65.8322 2.0986 21.3639 3.8593 3.4530 24.3926 7.6348 6.8544 3.1795 9.4504 10.7773 3.8163 9.0580 13.3382 49.9124 80.6795 0.6244 74.2708 15.2277 10.9814 50.5391 30.2273 1.4909 30.1013 130.3842 12.1859 51.6118 189.5045 660.8956 193.2625 212.8793 198.7851 63.8013 753.7467 594.6217 55.5675 23.3711 22.1043 23.0385 23.5234 24.2079 7.7405 19.9250 47.7248 18.0991 115.8793 30.8743
temp: 298.150 k
press: 1.00000 atm
elementType: 8 7 7 7 7 6 6 6 6 6 6 6 6 6 6 6 1 1 1 1 1 1 1 1 1 1 1 1
symmnumber: 1
zpe: 574691.5 jmol-1
zpe.correction: 0.218888 hartree
zpe.thermalcorrener: 0.232753 hartree
zpe.thermalcorrenthalpy: 0.233697 hartree
zpe.thermalcorrgfe: 0.178012 hartree
zpe.sumelectzpe: -719.489549 hartree
zpe.sumelectthermal: -719.475685 hartree
zpe.sumelectthermalent: -719.474740 hartree
zpe.sumelectthermalfe: -719.530425 hartree
dipole: 4.0392 -7.3977 0.0240
dipole: 8.4286
quadrupole: -49.7110 -93.8410 -100.0609
quadrupole: -17.8128 0.0938 -0.0013
quadrupole: 31.4933 -12.6367 -18.8566 -17.8128 0.0938 -0.0013
hfenergy: -719.708437 hartree
pointgroup: C01 [X(C11H12N4O1)]
dipole: -1.5508087 -2.8126492 -0.8247708 debye
polarizability: 285.0893376|6.8524976|156.6220626|-7.5434475|28.2881593|74.7742537 unknown
InChI: InChI=1S/C11H12N4O/c1-7-2-4-8(5-3-7)13-10-6-9(12)14-11(16)15-10/h2-6,13-14H,12H2,1H3
charge 0 multiplicity 1
28 atoms
O  -2.665993 2.592557 1.121059
N  0.021071 -1.081454 -0.1528
N  -3.669459 0.582389 0.530238
N  -1.261599 0.80154 0.496528
N  -4.82861 -1.403079 -0.04145
C  1.344142 -0.56521 -0.049568
C  -1.212581 -0.489322 0.088737
C  4.075783 0.290481 0.097821
C  1.655563 0.762048 0.352226
C  2.403997 -1.454756 -0.375259
C  3.004664 1.164569 0.418823
C  3.745583 -1.029096 -0.301139
C  -2.377599 -1.314592 -0.119073
C  -3.627474 -0.735626 0.115673
C  5.519831 0.755283 0.179413
C  -2.483307 1.403266 0.738747
H  -0.024553 -2.05554 -0.458106
H  0.837132 1.440047 0.600117
H  2.179384 -2.484146 -0.687637
H  3.227912 2.192695 0.730766
H  4.546275 -1.733525 -0.556872
H  -2.300458 -2.354402 -0.446134
H  6.220878 -0.052216 -0.094766
H  5.708118 1.608767 -0.499339
H  5.778204 1.092186 1.201257
H  -4.552639 1.063944 0.717851
H  -4.831457 -2.370485 -0.351329
H  -5.721909 -0.952424 0.138316
