program: Gaussian 09
title: 000245267
version: EM64L-G09RevD.01
frameworkgroup: C1[X(C11H10O)]
method: RPBEPBE
basis: SDD
operation: Freq
keyword: #pfreq=noraman
keyword: PBEPBE/SDD
title: #p freq=noraman PBEPBE/SDD
converged: YES YES NO YES
title: Mulliken charges:
elementType: O C C C C C C C C C C C H H H H H H H H H H
charge: -0.444622 0.177427 0.453459 0.469715 -0.562162 -0.429634 0.159687 -0.366392 -0.462656 -0.429311 -0.211983 -0.812529 0.273741 0.234855 0.228430 0.237707 0.216612 0.223880 0.228026 0.227984 0.228739 0.359027
chargesum: 0.00000
title: Mulliken charges with hydrogens summed into heavy atoms:
elementType: O C C C C C C C C C C C
charge: -0.085595 0.177427 0.453459 0.469715 -0.288421 -0.194779 0.159687 -0.137962 -0.224949 -0.212699 0.011897 -0.127780
polarizability: 1.86721678e+02 -4.21623499e-01 1.33198461e+02 2.18448427e-03 1.33597074e-03 5.29515102e+01
1716.lowfreq: -10.8837 -3.0477 -0.0009 -0.0006 -0.0005 4.8970 84.9948 103.2717 167.2337
frequency: 84.9751 103.2694 167.2335 213.7707 215.0239 307.1454 343.2230 368.9152 416.0208 422.9390 481.5961 501.0313 516.7476 535.3278 572.6806 652.5258 695.7968 710.0052 746.4114 797.4713 831.9734 852.9121 871.1934 899.1770 919.4700 957.1033 978.2214 998.8275 1028.6564 1050.4854 1073.6052 1152.1663 1162.8829 1171.1633 1218.0051 1243.9051 1259.8198 1272.6988 1360.2222 1396.8384 1407.1215 1428.9292 1435.2679 1468.5369 1470.5687 1483.0036 1522.6117 1584.7378 1607.1926 1645.2117 2973.1266 3048.9996 3086.4961 3113.3201 3113.9936 3131.0568 3139.3793 3155.3501 3157.7454 3583.1401
redmass: 1.0763 3.4115 3.8859 3.9078 3.8747 3.3378 3.5240 1.1493 5.1236 3.0751 4.1405 3.1633 6.1255 6.2467 3.2729 3.5796 5.4117 6.0886 1.3502 2.2432 1.5278 4.4537 1.4894 4.2666 1.4501 1.3133 1.3723 1.5730 2.6012 1.5560 2.0828 1.2898 1.3708 1.1492 2.2222 1.6834 2.3669 1.8123 2.2749 1.2364 3.6164 3.5023 3.9503 1.0460 1.2555 2.3657 3.5710 7.3608 5.9220 6.9041 1.0374 1.0974 1.0984 1.0885 1.0864 1.0891 1.0972 1.0922 1.0989 1.0659
irintensity: 1.0092 1.8003 5.8937 0.4362 5.0451 5.0958 3.8295 136.7284 0.4710 1.1968 2.2221 3.9419 4.3644 0.8993 4.8226 5.1638 0.4275 6.9233 47.9468 0.0284 70.5764 15.0459 18.1884 11.9218 3.5414 0.8180 4.4403 23.7598 68.6197 13.5138 16.0315 52.6726 70.7662 4.3955 0.0521 14.1692 28.0889 25.2618 0.4057 9.8929 23.9998 4.5532 21.8468 13.2652 16.4814 7.1605 11.1725 47.6639 29.1081 1.1754 43.6034 23.1221 18.2454 17.2701 7.5333 6.3655 34.0836 9.0533 25.8183 34.5519
temp: 298.150 k
press: 1.00000 atm
elementType: 8 6 6 6 6 6 6 6 6 6 6 6 1 1 1 1 1 1 1 1 1 1
symmnumber: 1
zpe: 461203.6 jmol-1
zpe.correction: 0.175663 hartree
zpe.thermalcorrener: 0.185651 hartree
zpe.thermalcorrenthalpy: 0.186596 hartree
zpe.thermalcorrgfe: 0.140530 hartree
zpe.sumelectzpe: -499.565885 hartree
zpe.sumelectthermal: -499.555897 hartree
zpe.sumelectthermalent: -499.554953 hartree
zpe.sumelectthermalfe: -499.601018 hartree
dipole: -0.8841 0.2593 -0.0010
dipole: 0.9214
quadrupole: -54.9136 -61.9375 -75.8960
quadrupole: -5.0464 0.0022 0.0008
quadrupole: 9.3354 2.3116 -11.6470 -5.0464 0.0022 0.0008
hfenergy: -499.7415486 hartree
pointgroup: C01[X(C11H10O1)]
dipole: 0.3497255 -0.0951723 -0.0058243 debye
dipolederiv: -0.0821207 -0.0030831 -0.0026704 0.2170798 -1.3968456 -0.0303307 0.0037366 -0.0286848 -0.4086248 0.1110324 0.2138377 0.0053443 0.0138371 -0.2211501 -0.006586 -0.0004517 -0.008136 0.002895 0.1787928 0.0348329 0.0001434 0.0251894 -0.0761596 -0.0041563 -0.0001273 -0.0041725 0.060964 0.3785302 0.2181342 0.0030551 0.1363636 0.0133953 0.0005183 0.000409 -0.0001231 -0.0413364 -0.244201 -0.1418838 -0.0034378 0.0731377 0.0227798 0.0046291 0.0027732 0.0062149 -0.1585749 -0.0687895 -0.0391179 -0.0019193 -0.0423567 0.124117 0.0088275 -0.0020171 0.0087302 -0.1729903 0.1009878 -0.0164713 -0.0008316 -0.265836 1.3045765 0.0383399 -0.0081206 0.0365083 0.0548318 -0.0492417 -0.1185927 -0.0043472 -0.1525012 0.0518557 0.0077828 -0.0051966 0.0075513 -0.1777501 -0.1960395 0.0043113 -0.0000692 0.0815537 0.0201493 0.0063186 0.0021922 0.0067993 -0.2213053 -0.054325 -0.323108 -0.0107314 0.0935262 -0.2591605 -0.0016281 0.0013779 0.001591 -0.2275779 0.072195 0.0747292 0.0004682 -0.1237374 0.1791888 0.0103468 -0.0052796 0.008862 -0.1446113 -0.1517907 -0.0805589 -0.0005886 -0.0122491 0.054933 -0.0005077 0.001767 0.0000688 0.075992 0.0960595 -0.0191922 -0.000111 -0.0513107 -0.0386201 -0.0051957 -0.001021 -0.0054333 0.1556654 0.0685636 -0.0472695 -0.0007249 0.0147623 -0.1182751 -0.0079079 0.0010292 -0.0073804 0.1530205 -0.0941077 0.1081329 0.0049309 0.0943091 0.0380592 -0.0039383 0.0044477 -0.004017 0.1500001 0.0712907 0.0309377 0.0016343 -0.0397357 -0.1122409 -0.0077893 -0.0004016 -0.0082778 0.1681685 -0.0616066 0.1030033 0.0048465 0.1348173 -0.0196396 -0.0067878 0.0057647 -0.0065612 0.1779802 -0.0984394 -0.0959314 -0.0007884 -0.0886486 0.0416828 -0.0027513 -0.00055 -0.0026896 0.1600623 -0.0467491 -0.0145132 0.0898074 -0.0031798 0.0739461 -0.0704723 0.149314 -0.0278429 -0.0525553 -0.0504098 -0.0086143 -0.0904646 0.0070242 0.0675933 0.0775663 -0.1492115 0.0350772 -0.0424194 0.0734686 0.0731261 0.0024456 -0.0564026 -0.1409964 -0.0069837 -0.0014622 -0.0079533 0.1071037 0.0469002 0.047291 0.0040087 -0.0556428 0.3908112 0.0007059 0.0010276 -0.0001312 0.3810622 unknown
polarizability: 186.7102681|0.6368555|133.1351952|-1.005719|2.3149584|53.0261858 unknown
InChI: InChI=1S/C11H10O/c1-8-5-6-9-3-2-4-11(12)10(9)7-8/h2-7,12H,1H3
charge 0 multiplicity 1
22 atoms
O  1.33375 -2.496302 -0.084145
C  0.207216 -0.362407 -0.013542
C  0.271049 1.081879 0.027813
C  -2.260606 -0.292316 0.007238
C  -1.064706 -1.02008 -0.022851
C  -0.965338 1.808554 0.058085
C  1.4454 -1.093457 -0.044238
C  -2.190815 1.14304 0.048119
C  1.5453 1.741351 0.03713
C  2.679791 -0.43435 -0.034698
C  2.723606 0.9933 0.006419
C  -3.612555 -0.982786 -0.002404
H  -1.081536 -2.114005 -0.054148
H  -0.931071 2.904308 0.089197
H  -3.125077 1.718078 0.071548
H  1.580116 2.836096 0.068377
H  3.616387 -1.006958 -0.058606
H  3.697841 1.493772 0.013392
H  -4.200293 -0.726947 0.899945
H  -4.214606 -0.673825 -0.87827
H  -3.504965 -2.080209 -0.036002
H  2.229011 -2.916535 -0.103459
