program: Gaussian 09
title: 000245279
version: EM64L-G09RevD.01
frameworkgroup: C1[X(C10H8BrN5O2)]
method: RPBEPBE
basis: SDD
operation: Freq
keyword: #p
keyword: freq=noraman
keyword: PBEPBE/SDD
title: #p freq=noraman PBEPBE/SDD
converged: NO YES NO NO
title: Mulliken charges:
elementType: Br O O N N N N N C C C C C C C C C C H H H H H H H H
charge: 0.040037 -0.181708 -0.218601 -0.459521 -0.450732 -0.032854 -0.619723 -0.066513 0.389676 0.419195 -0.107009 -0.399840 -0.416707 0.168437 0.028653 -0.144327 -0.159303 -0.241823 0.363258 0.341906 0.264652 0.283667 0.260675 0.258601 0.363583 0.316320
chargesum: 0.00000
title: Mulliken charges with hydrogens summed into heavy atoms:
elementType: Br O O N N N N N C C C C C C C C C C
charge: 0.040037 -0.181708 -0.218601 -0.096262 -0.108826 -0.032854 0.060180 -0.066513 0.389676 0.419195 -0.107009 -0.135188 -0.133040 0.168437 0.028653 0.116348 0.099298 -0.241823
polarizability: 3.31108042e+02 2.82982355e+01 1.75873090e+02 -8.36665098e+00 1.05444542e+01 8.09718586e+01
1716.lowfreq: -4.8488 -2.5657 0.0004 0.0004 0.0005 3.0182 29.2230 32.5436 46.9909
frequency: 29.2183 32.5066 46.9885 57.5921 115.8874 150.6927 161.6075 165.4975 204.1903 221.7232 226.1411 247.4853 279.8209 323.3072 330.3376 357.8466 376.0154 398.4862 411.2381 488.7266 519.8457 530.9542 545.0939 590.4212 612.3643 624.9997 641.1455 649.3749 686.2562 692.8675 727.2456 741.5367 763.3185 816.8722 827.5885 832.1773 858.4690 955.1590 960.8570 967.4492 975.7519 992.3441 1062.1900 1112.7424 1116.9008 1149.8718 1187.3806 1204.6468 1241.0253 1295.2257 1305.0172 1347.8429 1353.4945 1378.9108 1396.3289 1430.3840 1479.4169 1503.5883 1570.2144 1593.2425 1598.7103 1601.4249 1608.6394 1663.9128 3139.5006 3150.0771 3170.8105 3177.3788 3218.5170 3494.6755 3546.6046 3697.6054
redmass: 10.0226 5.9235 9.0332 5.1719 7.6797 15.0372 6.6332 8.9229 5.6029 4.0775 12.1009 1.3357 5.4417 10.0086 4.8424 6.2442 5.7512 9.7451 3.0213 3.5131 5.0009 8.7947 1.1601 1.2835 6.7724 6.9881 7.1091 5.1132 7.0004 5.0230 5.8225 5.4768 10.3366 2.2992 1.4030 1.2750 1.9167 1.3304 5.5679 1.4781 2.0251 4.4582 2.6705 1.5791 2.6805 4.2405 1.1186 6.3469 1.9172 1.3111 1.8412 4.7809 10.1075 4.5908 3.9309 2.5293 2.7598 5.4969 7.2203 8.5625 4.7376 2.2696 1.8157 4.2907 1.0898 1.0901 1.0957 1.0968 1.0751 1.0778 1.0456 1.1053
irintensity: 7.7996 5.8048 0.5290 1.5769 5.7221 2.5191 0.8383 0.7261 2.7055 8.9294 0.6704 52.3165 9.3457 8.7095 3.5740 5.7779 2.5112 1.2631 1.2777 34.4659 12.8374 8.4948 283.5496 50.7845 13.1228 0.9775 11.3303 11.7613 4.2927 7.5817 1.9028 2.7515 16.5174 54.9267 24.9831 5.4997 103.4238 0.7674 36.4483 0.8622 4.6262 41.8941 45.2060 23.3171 32.3130 14.5637 2.4948 181.9239 53.2135 6.4334 115.2935 64.7936 175.7020 67.0860 14.9021 57.2207 171.6001 262.5568 19.8096 514.1750 345.7000 417.6634 295.9774 493.8799 7.1191 4.2131 2.7970 1.0074 184.5171 42.3540 110.1619 49.7155
temp: 298.150 k
press: 1.00000 atm
elementType: 35 8 8 7 7 7 7 7 6 6 6 6 6 6 6 6 6 6 1 1 1 1 1 1 1 1
symmnumber: 1
zpe: 466146.9 jmol-1
zpe.correction: 0.177546 hartree
zpe.thermalcorrener: 0.193806 hartree
zpe.thermalcorrenthalpy: 0.194750 hartree
zpe.thermalcorrgfe: 0.131391 hartree
zpe.sumelectzpe: -822.200406 hartree
zpe.sumelectthermal: -822.184146 hartree
zpe.sumelectthermalent: -822.183201 hartree
zpe.sumelectthermalfe: -822.246561 hartree
dipole: 9.9188 6.0118 -1.1744
dipole: 11.6578
quadrupole: -184.1832 -100.4038 -110.8579
quadrupole: -20.4840 2.2551 4.0550
quadrupole: -52.3683 31.4112 20.9571 -20.4840 2.2551 4.0550
hfenergy: -822.3779517 hartree
pointgroup: C01 [X(C10H8Br1N5O2)]
dipole: 3.7214685 2.6766553 -0.1494329 debye
dipolederiv: -0.8043692 -0.1597186 -0.0235818 -0.2223546 -0.0752245 -0.026644 -0.0231264 -0.0204231 -0.028833 -1.2046625 -0.1810782 0.0159129 -0.1466586 -0.476984 0.0116991 -0.007349 0.0025967 -0.3420389 -0.7345936 -0.744658 -0.0099964 -0.3715312 -0.8550728 -0.0079563 -0.0603338 -0.008012 -0.1581185 -2.2812971 -0.0597627 -0.0102544 0.2877417 -0.2921277 0.0006079 0.0420925 0.0094699 -0.2974456 -0.9231373 0.3410762 -0.009939 0.5572246 -1.2243297 0.0143024 0.0377094 0.0014369 -0.2119901 -0.886396 -0.5157616 0.0295942 -0.1662625 -1.2954883 0.0250075 0.0102453 0.0020045 -0.3109955 -0.2745591 -0.1194623 0.0089046 0.004376 -1.5290058 0.0258149 -0.0066515 0.0265319 -0.7183474 0.2626082 0.613546 -0.0059812 0.5287927 1.2955643 0.0274581 0.1171661 0.048882 -0.1529186 2.106883 0.4037508 0.0188057 -0.6844379 1.1447915 -0.0584019 -0.2590872 -0.067975 0.1976181 1.6090006 0.1752405 0.0255365 0.466298 0.0578008 0.0496623 -0.0141515 0.0075506 0.1103271 -1.1935326 0.02928 0.0121316 -0.3306631 -1.1664141 -0.0072283 -0.0951564 -0.043804 -0.0247148 -0.3700354 -0.0116187 -0.0090887 0.0934228 -0.0351 0.0972648 0.0604564 0.1051692 -0.0549015 -0.2684791 0.0526353 -0.0286768 -0.1564273 -0.1647894 0.0449225 -0.165299 0.0624765 -0.0595914 1.420565 0.0696457 -0.0450947 -0.2122437 2.0043434 -0.0296305 -0.0447796 -0.0077545 0.2335804 1.7233882 0.042944 -0.0263767 0.0485978 1.3623741 -0.0338854 0.0732698 0.0224855 0.2807141 -0.2200839 -0.1021497 -0.0799117 -0.0618502 -0.0257032 0.0495602 -0.0800879 0.0634745 0.0079134 -0.2873237 -0.0586411 0.0012092 -0.0395096 -0.0099029 0.0742195 0.0351077 0.0843162 0.0146428 1.2772786 0.3407381 0.0440044 0.3598234 -0.0154867 0.0608368 0.0176208 0.0356987 -0.1126871 0.3577347 0.0180187 0.0003347 0.2524017 0.2697382 -0.0164393 0.1614804 0.0015003 0.2658882 0.2298159 -0.0193627 0.009731 -0.0664049 0.1589415 -0.0069837 0.0735917 -0.0212374 0.2849124 0.058424 -0.0665567 -0.0342264 -0.0602984 0.0692325 -0.0907317 -0.0236659 -0.0856936 0.07646 -0.0059348 0.0188811 0.0797709 0.0163595 0.1034264 -0.0548183 0.1080433 -0.0616243 0.0674829 0.0247 0.0350722 0.0611932 0.0275308 0.1034495 -0.0612559 0.0738918 -0.0557014 0.0861613 0.0722565 -0.0295354 -0.0224524 -0.0454072 0.0628596 -0.091287 -0.0350443 -0.0854005 0.0686916 0.1906381 -0.0887297 0.0021663 -0.0551513 0.2904757 0.0007606 0.0041218 -0.0019663 0.3942059 0.1211113 0.0162068 -0.003715 -0.0233683 0.2426317 0.0031459 -0.0000644 -0.0140014 0.3839839 unknown
polarizability: 326.2514691|39.7865201|177.7623995|-2.4144327|20.2658915|83.9391219 unknown
InChI: InChI=1S/C10H8BrN5O2/c11-5-1-3-6(4-2-5)13-8-7(16-18)9(17)15-10(12)14-8/h1-4,13-14H,12H2
charge 0 multiplicity 1
26 atoms
Br 6.193195 0.716309 0.096532
O  -4.59028 -0.486265 -0.054838
O  -3.06861 -2.999559 -0.146296
N  0.228399 -0.95759 -0.174306
N  -0.831835 1.187372 -0.13015
N  -3.238178 1.423452 -0.075803
N  -1.862291 3.316735 -0.125677
N  -2.035572 -2.230044 -0.160495
C  -0.906639 -0.192305 -0.121952
C  1.584984 -0.540395 -0.106268
C  -2.185506 -0.827098 -0.106868
C  2.537784 -1.1675 -0.951453
C  2.020301 0.444524 0.823362
C  -2.033685 1.947847 -0.109717
C  -3.42903 -0.004075 -0.078277
C  3.898967 -0.807199 -0.886185
C  3.379657 0.821885 0.877442
C  4.307654 0.197007 0.018568
H  -0.040428 -1.961665 -0.260368
H  0.083716 1.63731 -0.218421
H  2.210319 -1.930015 -1.665928
H  1.321647 0.865236 1.554904
H  4.627204 -1.295409 -1.539638
H  3.711385 1.572094 1.600896
H  -2.713644 3.87466 -0.12306
H  -0.956615 3.778787 -0.126104
