program: Gaussian 09
title: 000245264
version: EM64L-G09RevD.01
frameworkgroup: C1[X(C12H8Cl2N4)]
method: RPBEPBE
basis: SDD
operation: Freq
keyword: #p
keyword: freq=noraman
keyword: PBEPBE/SDD
title: #p freq=noraman PBEPBE/SDD
converged: YES YES NO NO
title: Mulliken charges:
elementType: Cl Cl N N N N C C C C C C C C C C C C H H H H H H H H
charge: 0.048310 0.031955 -0.101916 0.061609 -0.019910 0.066948 -0.587282 0.158495 0.500605 0.173292 -0.166755 -0.399588 -0.362850 -0.322962 -0.222596 -0.228737 -0.230124 -0.363547 0.261832 0.244915 0.237002 0.265677 0.231510 0.232008 0.234357 0.257751
chargesum: 0.00000
title: Mulliken charges with hydrogens summed into heavy atoms:
elementType: Cl Cl N N N N C C C C C C C C C C C C
charge: 0.048310 0.031955 -0.101916 0.061609 -0.019910 0.066948 -0.080535 0.158495 0.500605 0.173292 -0.166755 -0.162586 -0.097173 -0.322962 0.008914 0.003271 0.004233 -0.105796
polarizability: 2.17977268e+02 2.19248305e+01 1.84837789e+02 4.83434964e-01 -6.59911530e+00 1.05621148e+02
1716.lowfreq: -3.1289 -0.0022 -0.0010 0.0004 4.0022 6.5837 20.6556 33.7275 49.2464
frequency: 20.2281 33.7001 49.2402 83.5736 118.6812 144.9354 169.8982 177.9949 218.8170 279.1566 315.5569 341.1736 355.0978 370.0707 403.3017 404.6915 462.9271 549.6649 553.7767 585.0262 595.7032 617.4279 624.0882 660.1323 683.4596 703.1921 720.0612 781.7511 789.6748 811.4568 819.4274 861.0326 897.1977 917.6123 936.1817 972.9607 985.8554 990.5858 1004.1528 1027.9536 1083.1631 1096.3027 1134.2832 1166.4584 1176.0324 1192.3811 1211.1014 1223.8316 1277.4339 1290.6077 1320.0783 1340.2354 1358.4092 1377.2802 1386.5073 1399.6597 1418.2239 1445.2988 1462.9226 1486.3522 1508.8288 1562.4183 1596.5269 1615.0755 3032.1814 3093.9228 3125.5039 3127.7515 3139.5692 3151.4616 3167.5510 3187.5017
redmass: 5.0576 9.0839 5.0798 7.9603 11.5680 19.6505 6.2117 6.5662 7.4738 9.0492 6.0927 3.3246 3.4739 14.3761 9.5863 3.2523 3.9033 5.6958 6.5607 7.7149 6.1098 6.3171 7.1479 10.5288 7.5585 2.9539 1.8670 3.1688 8.7972 12.7178 3.5231 1.2450 3.9269 1.4329 1.4910 2.4480 1.3870 6.0789 1.3261 2.2656 2.4028 3.2924 6.1611 2.9838 1.0647 1.1364 2.8035 2.8635 6.6163 5.0966 1.8441 1.4640 1.7875 3.2674 6.1055 1.9187 4.9912 2.1616 1.2018 2.2103 8.2656 11.4805 6.0675 5.9888 1.0596 1.1048 1.0859 1.0887 1.0920 1.0962 1.1016 1.0930
irintensity: 0.0092 0.0825 0.0812 0.4833 0.1134 0.4368 0.3858 0.5322 1.2422 1.0218 0.0541 2.0731 1.9680 7.2938 4.5554 0.5849 3.1034 7.8126 13.4880 15.0582 13.3035 0.2036 2.7427 6.6963 39.0544 24.1238 79.7104 9.2261 0.6812 24.1539 6.2332 0.6389 51.0349 12.4940 0.9465 18.7035 0.9558 0.2746 1.2747 7.3254 52.8961 47.8200 11.8166 81.1723 1.0630 1.3218 13.1921 10.7978 104.0398 82.8757 28.5064 27.6614 14.5829 55.1603 5.2774 53.2066 206.7470 5.9533 57.1826 24.2607 131.2308 112.8434 1.4517 1.7564 15.5240 1.4151 3.2825 0.5437 8.3527 25.5972 22.4579 7.7002
temp: 298.150 k
press: 1.00000 atm
elementType: 17 17 7 7 7 7 6 6 6 6 6 6 6 6 6 6 6 6 1 1 1 1 1 1 1 1
symmnumber: 1
zpe: 473675.0 jmol-1
zpe.correction: 0.180413 hartree
zpe.thermalcorrener: 0.194946 hartree
zpe.thermalcorrenthalpy: 0.195890 hartree
zpe.thermalcorrgfe: 0.136104 hartree
zpe.sumelectzpe: -1599.943790 hartree
zpe.sumelectthermal: -1599.929257 hartree
zpe.sumelectthermalent: -1599.928313 hartree
zpe.sumelectthermalfe: -1599.988099 hartree
dipole: 5.1424 -0.6217 1.6767
dipole: 5.4444
quadrupole: -122.4208 -115.1444 -115.3221
quadrupole: 1.9279 -6.6477 4.0667
quadrupole: -4.7917 2.4847 2.3070 1.9279 -6.6477 4.0667
hfenergy: -1600.124203 hartree
pointgroup: C01 [X(C12H8Cl2N4)]
dipole: -1.9927935 0.1876251 0.7627018 debye
dipolederiv: -0.3133141 -0.323294 0.0360475 -0.3391882 -0.5298843 0.0188134 0.0536528 0.0189799 -0.0207766 -0.7020104 0.1785923 0.3487894 0.2797026 -0.1487547 -0.1612406 0.4337878 -0.1264457 -0.2883189 -0.8782706 -0.1337587 0.0516153 -0.0096629 -0.6707804 -0.0575593 0.3091978 -0.0629619 -0.2506127 -0.8570442 -0.3080097 0.122277 -0.2808259 -0.558586 -0.0000607 0.2804703 0.0420499 -0.2384413 -0.6062895 -0.0528585 0.1241667 -0.1387798 -0.4097671 -0.0867895 0.1119907 -0.0785198 -0.275264 -0.550222 0.0266841 0.1663132 0.273291 -0.811934 -0.3644478 0.3141837 -0.2397839 -0.3532197 0.8142517 -0.139715 0.0027571 -0.1891118 0.1839789 -0.0701127 -0.1744239 -0.0255591 0.3286647 0.7825536 0.4559646 -0.0523488 0.1897022 0.222363 0.0616669 -0.2700133 -0.1908848 0.1583918 0.0388775 -0.0188736 0.0984423 -0.0268573 -0.0017594 -0.0095241 0.1191281 0.0038095 -0.1145912 -0.606143 -0.005052 0.2895414 0.3893517 0.3063059 -0.0699296 0.5066862 0.0705068 -0.0718832 1.003801 0.477131 -0.2572021 0.101315 1.200919 0.1421804 -0.5089138 0.1114756 0.2114742 -0.1321707 -0.0201323 0.0405849 0.0573137 0.046136 -0.0451045 0.0118092 -0.0431042 -0.1004524 -0.0827685 0.0774534 0.042134 0.0723013 -0.0616964 -0.0080028 0.0238675 0.0139931 -0.1079183 1.3276718 -0.1405133 -0.635723 -0.391483 0.6828351 0.4043249 -0.8045854 0.2918922 0.5057778 0.0051286 0.1173435 0.072696 0.1232057 0.003756 0.0284905 0.072393 0.0371546 -0.0917329 -0.1240498 0.0093056 0.0270445 -0.0162613 0.1285351 -0.0635323 0.0243311 -0.0813355 -0.0983201 -0.0057332 -0.0240124 0.1278378 -0.0194031 -0.0410516 -0.0512594 0.1070433 -0.0510525 -0.0430951 0.5138704 -0.0426264 -0.2533019 0.0480555 0.4925207 0.20927 -0.279601 0.2064317 0.1477164 -0.0084872 0.004016 -0.0744879 0.0368783 0.0371924 -0.1064035 -0.0121041 -0.0238009 0.0369457 -0.0135398 -0.0128432 0.0286484 -0.0064953 -0.0305672 0.124756 0.0104787 0.018841 0.0832709 0.1376972 0.0316808 -0.0420119 0.0079637 -0.0692325 0.0703718 -0.0345917 0.0682834 0.0939107 0.0925414 -0.0906512 -0.0579964 -0.1053229 0.0603946 -0.0067554 -0.0486513 -0.014698 0.1016293 -0.0100121 -0.0904775 -0.0731939 -0.1094123 0.0098373 -0.0251552 -0.0877437 -0.0183428 0.1119341 0.0981795 -0.0110551 -0.032743 0.018025 -0.0886346 0.0699051 -0.0458439 0.0668324 0.1102434 -0.0125848 0.0398354 -0.1199498 0.0426965 0.0747552 0.0526212 -0.1342101 0.0539219 0.0586928 0.0880672 -0.004134 0.0200633 -0.0069985 -0.0268809 -0.0565228 0.021662 -0.047683 0.1059746 unknown
polarizability: 216.0489776|23.2141236|186.5400323|-6.9247463|4.0135201|105.8471956 unknown
InChI: InChI=1S/C12H8Cl2N4/c13-10-9-11(16-7-15-10)18(12(14)17-9)6-8-4-2-1-3-5-8/h1-5,7H,6H2
charge 0 multiplicity 1
26 atoms
Cl -0.253267 -3.357622 0.134338
Cl 4.727679 -0.218066 -1.454754
N  0.204841 -0.700757 0.762332
N  1.880844 -1.719804 -0.461877
N  1.201593 1.553691 0.989011
N  3.385899 1.714789 -0.098036
C  -1.088831 -0.480933 1.462541
C  1.19352 0.267411 0.561367
C  -2.20316 -0.008716 0.534471
C  2.227863 -0.384653 -0.199007
C  0.688386 -1.850733 0.119461
C  -3.211966 -0.904359 0.102766
C  -2.240298 1.342514 0.104137
C  3.336013 0.434786 -0.504082
C  -4.243604 -0.458488 -0.754514
C  -3.269142 1.786683 -0.754511
C  -4.272791 0.887292 -1.18609
C  2.333919 2.22197 0.624727
H  -0.878901 0.275911 2.238128
H  -1.357333 -1.428215 1.959742
H  -3.190466 -1.949399 0.434205
H  -1.462353 2.037198 0.443209
H  -5.020507 -1.157298 -1.083353
H  -3.291962 2.831484 -1.083125
H  -5.072073 1.233477 -1.850674
H  2.418498 3.265939 0.935084
