program: Gaussian 09
title: 000245262
version: EM64L-G09RevD.01
frameworkgroup: C1[X(C12H9ClN4O)]
method: RPBEPBE
basis: SDD
operation: Freq
keyword: #p
keyword: freq=noraman
keyword: PBEPBE/SDD
title: #p freq=noraman PBEPBE/SDD
converged: YES YES NO NO
title: Mulliken charges:
elementType: Cl O N N N N C C C C C C C C C C C C H H H H H H H H H
charge: -0.008140 -0.245989 -0.138291 -0.074163 -0.283147 0.107896 -0.598878 0.112096 0.085939 0.491906 -0.192540 0.068435 -0.394308 -0.377803 -0.210967 -0.227081 -0.226699 -0.230593 0.279564 0.231401 0.268021 0.355797 0.222412 0.289751 0.228850 0.233660 0.232872
chargesum: 0.00000
title: Mulliken charges with hydrogens summed into heavy atoms:
elementType: Cl O N N N N C C C C C C C C C C C C
charge: -0.008140 -0.245989 -0.138291 -0.074163 0.072649 0.107896 -0.087912 0.112096 0.085939 0.491906 0.075481 0.068435 -0.171897 -0.088052 -0.210967 0.001768 0.006961 0.002278
polarizability: 2.20043259e+02 1.10627866e+01 1.64150066e+02 4.46856035e+00 -7.04488529e+00 1.06329392e+02
1716.lowfreq: -6.7789 0.0014 0.0021 0.0028 3.4851 7.3620 20.7149 34.9253 54.9739
frequency: 20.2579 34.9181 54.9547 81.5029 142.7446 158.5221 173.8628 208.7312 232.3379 262.8778 320.6274 339.5687 363.8006 395.1207 405.2654 460.1630 480.8879 536.8355 570.5510 604.8230 614.7344 617.4100 630.6735 650.5779 672.7453 685.8221 711.2794 754.6690 769.0081 788.2685 809.5399 826.8838 862.8400 878.2515 938.0219 945.3351 961.3761 987.8424 990.0849 1008.5258 1027.4106 1070.2600 1089.3717 1127.8135 1169.2641 1175.1927 1178.1454 1193.2641 1210.7796 1268.3485 1307.9639 1321.7054 1336.4559 1353.8473 1377.7069 1391.3906 1422.6819 1444.9205 1469.6826 1486.3499 1503.2964 1520.3056 1593.4992 1596.2443 1613.6552 1616.1349 3028.9915 3096.5249 3112.4387 3128.3964 3137.3405 3150.0289 3166.3042 3244.8375 3548.7280
redmass: 5.4740 6.4944 5.6155 8.1942 8.5165 5.7141 6.0947 7.2725 11.5355 7.1714 8.5273 3.3650 6.8189 3.3278 2.8486 4.0220 9.4375 6.5152 4.7971 1.9536 3.8743 4.9036 3.3275 6.3110 7.8788 5.1152 1.6122 3.7600 7.8075 3.7200 1.9688 2.2965 1.2511 10.7773 1.5050 1.8871 5.2448 1.3870 5.8475 1.3218 2.2654 4.6870 1.7737 3.1099 1.5753 1.0696 1.9963 1.1395 2.8625 3.5177 3.7527 2.2556 1.4356 1.8226 3.8555 3.1720 2.4930 2.1387 1.3081 2.1257 3.3928 9.0877 9.9935 6.3937 6.7140 8.5723 1.0608 1.1045 1.0884 1.0872 1.0916 1.0959 1.1014 1.0989 1.0797
irintensity: 0.2374 1.2402 2.4095 1.2725 1.8275 5.0665 0.6412 2.6920 0.9822 2.1650 5.7026 17.3532 9.0648 12.3797 0.3408 8.3493 2.9145 1.5968 0.1046 65.2412 43.4358 21.9320 13.2949 9.0905 3.9224 8.3653 82.5308 58.3072 0.7136 9.8153 25.1185 6.4926 1.0778 101.6385 3.6392 2.1528 11.4162 0.9553 0.2132 2.2486 6.8963 7.4388 8.0971 69.0637 14.9414 3.6710 201.2651 0.3420 20.0062 23.5317 17.9078 15.2801 2.9732 39.9605 22.2872 30.7101 62.7199 6.5784 79.2974 64.7102 151.8798 82.8490 372.9298 22.0962 101.4769 262.5700 25.9992 0.6716 11.4707 2.3610 7.0673 21.5132 28.9308 1.3259 103.5025
temp: 298.150 k
press: 1.00000 atm
elementType: 17 8 7 7 7 7 6 6 6 6 6 6 6 6 6 6 6 6 1 1 1 1 1 1 1 1 1
symmnumber: 1
zpe: 510994.0 jmol-1
zpe.correction: 0.194627 hartree
zpe.thermalcorrener: 0.209016 hartree
zpe.thermalcorrenthalpy: 0.209960 hartree
zpe.thermalcorrgfe: 0.151021 hartree
zpe.sumelectzpe: -1215.719139 hartree
zpe.sumelectthermal: -1215.704750 hartree
zpe.sumelectthermalent: -1215.703806 hartree
zpe.sumelectthermalfe: -1215.762746 hartree
dipole: 2.9444 4.2628 -1.4321
dipole: 5.3751
quadrupole: -100.5552 -114.2823 -111.5912
quadrupole: -4.4666 1.9768 9.2860
quadrupole: 8.2543 -5.4727 -2.7816 -4.4666 1.9768 9.2860
hfenergy: -1215.9137661 hartree
pointgroup: C01[X(C12H9Cl1N4O1)]
dipole: -1.0602753 -1.7760522 -0.439912 debye
polarizability: 217.6978642|14.6185672|166.3955497|-9.935925|3.339251|106.4293038 unknown
InChI: InChI=1S/C12H9ClN4O/c13-12-15-10-9(11(18)16-12)17(7-14-10)6-8-4-2-1-3-5-8/h1-5,7,15H,6H2
charge 0 multiplicity 1
27 atoms
Cl 5.121829 1.21138 -1.055582
O  0.733961 1.879124 1.472045
N  0.00336 -1.089377 0.726448
N  1.441528 -2.385844 -0.501383
N  3.197322 -0.640532 -0.755824
N  2.743565 1.480558 0.274166
C  -1.227708 -0.665718 1.456243
C  1.116305 -0.283939 0.439249
C  1.969674 -1.122908 -0.309787
C  -2.313237 -0.129313 0.528733
C  0.244104 -2.322918 0.142784
C  1.453678 1.089314 0.794998
C  -3.3334 -0.984297 0.043063
C  -2.305685 1.23563 0.143886
C  3.487251 0.671462 -0.412281
C  -4.329658 -0.487281 -0.827024
C  -3.301326 1.731557 -0.726688
C  -4.313163 0.872269 -1.215391
H  -0.912266 0.110749 2.172124
H  -1.586714 -1.546451 2.017393
H  -0.461586 -3.147825 0.201251
H  3.836704 -1.223722 -1.299966
H  -3.35576 -2.038176 0.34971
H  -1.523828 1.898996 0.532761
H  -5.116992 -1.153807 -1.195852
H  -3.290678 2.787191 -1.01914
H  -5.085977 1.259675 -1.888533
