program: Gaussian 09
title: 000245222
version: EM64L-G09RevD.01
frameworkgroup: C1[X(C10H12N4S2)]
method: RPBEPBE
basis: SDD
operation: Freq
keyword: #p
keyword: freq=noraman
keyword: PBEPBE/SDD
title: #p freq=noraman PBEPBE/SDD
converged: YES YES NO NO
title: Mulliken charges:
elementType: S S N N N N C C C C C C C C C C H H H H H H H H H H H H
charge: 0.209469 0.276909 -0.119951 -0.053023 -0.026832 0.001164 -0.498744 -0.356816 -0.371224 -0.676963 0.145687 -0.209412 0.110069 -0.358524 -0.380211 -0.823769 0.318844 0.227381 0.252240 0.230077 0.234589 0.267394 0.260907 0.287080 0.247623 0.282419 0.281435 0.242184
chargesum: 0.00000
title: Mulliken charges with hydrogens summed into heavy atoms:
elementType: S S N N N N C C C C C C C C C C
charge: 0.209469 0.276909 -0.119951 -0.053023 -0.026832 0.001164 -0.179900 0.122804 0.093442 -0.148662 0.145687 0.077668 0.110069 -0.358524 -0.132587 -0.017731
polarizability: 2.71435003e+02 -4.97769068e+00 1.52598121e+02 1.99720048e+00 -2.58538346e+00 1.01544378e+02
1716.lowfreq: -11.9526 0.0012 0.0019 0.0024 3.8779 6.5816 24.7095 46.6533 55.2849
frequency: 24.1382 46.6428 55.1481 75.6126 102.9750 109.8863 137.5372 176.9109 202.7193 222.3037 252.8010 259.6981 284.1777 364.3497 402.6609 456.2059 488.1474 537.4485 545.5497 593.9073 618.8208 627.1384 636.8502 647.3892 658.1033 689.9246 756.7464 791.0062 814.6240 837.0789 859.3003 883.1088 904.2111 916.6197 920.1373 977.3494 978.2846 992.1364 1023.8177 1066.9802 1090.1154 1107.0585 1116.6817 1164.1209 1172.7430 1194.0913 1210.7765 1247.2021 1275.0912 1278.1375 1291.0036 1303.1715 1315.1993 1332.5752 1344.8776 1363.5138 1387.2868 1395.3776 1433.9116 1436.3195 1448.5351 1454.4992 1463.1202 1469.8533 1518.5228 1540.3477 2999.3153 3003.2559 3026.4311 3033.0375 3057.9888 3066.7820 3078.5915 3115.7837 3151.6865 3158.0751 3171.3559 3244.1811
redmass: 4.6611 5.1917 3.3821 3.5514 1.2490 3.4423 6.0201 4.9444 6.1126 6.7825 3.3851 3.4010 2.8834 7.4950 12.0411 3.9622 2.7572 5.7184 5.7709 8.1983 6.0242 7.4618 3.8025 4.7616 7.1400 5.0868 4.8876 6.0209 9.2788 1.6117 1.5074 2.0362 2.6137 4.5574 1.4340 2.0014 1.1803 1.3081 1.4077 1.5498 2.8924 4.0746 2.2290 1.4980 3.5562 1.8924 1.5524 1.5060 1.2530 1.9640 6.2691 4.7300 1.5817 1.3351 1.1360 7.3170 1.3881 1.7133 1.0524 4.4947 1.0561 1.0895 1.0842 1.1056 9.3637 10.5728 1.0601 1.0622 1.0282 1.0613 1.0941 1.0970 1.0985 1.1081 1.1043 1.1055 1.0922 1.0983
irintensity: 0.3377 2.6213 1.0794 2.2483 0.3546 0.6996 0.5446 5.0485 0.3699 0.6547 1.0701 0.9001 1.8976 2.4073 4.3676 0.8251 4.6279 5.7552 3.5305 11.3553 1.7346 4.3395 5.1944 15.1214 4.4507 3.6762 72.3322 5.3685 18.4826 9.2689 10.0458 31.1967 16.2981 32.3442 11.9252 23.2432 7.0178 6.5806 4.9804 1.8941 19.2416 2.4169 3.0954 3.5001 115.6183 55.6961 68.2731 10.4000 12.7260 0.9098 66.3328 73.4914 6.3855 0.6530 2.1358 61.6826 18.3612 37.0068 14.1123 87.5817 34.4885 7.0510 15.1787 6.7580 191.5899 149.1831 21.6950 26.4483 23.9967 30.5665 6.4334 26.3987 14.3793 17.9759 8.1769 9.8384 15.1223 0.7376
temp: 298.150 k
press: 1.00000 atm
elementType: 16 16 7 7 7 7 6 6 6 6 6 6 6 6 6 6 1 1 1 1 1 1 1 1 1 1 1 1
symmnumber: 1
zpe: 558650.5 jmol-1
zpe.correction: 0.212779 hartree
zpe.thermalcorrener: 0.227729 hartree
zpe.thermalcorrenthalpy: 0.228673 hartree
zpe.thermalcorrgfe: 0.168591 hartree
zpe.sumelectzpe: -1402.219045 hartree
zpe.sumelectthermal: -1402.204095 hartree
zpe.sumelectthermalent: -1402.203151 hartree
zpe.sumelectthermalfe: -1402.263232 hartree
dipole: 3.4098 1.2335 2.1064
dipole: 4.1935
quadrupole: -83.0432 -114.5690 -111.1670
quadrupole: -5.5516 8.6659 0.3885
quadrupole: 19.8832 -11.6426 -8.2406 -5.5516 8.6659 0.3885
hfenergy: -1402.4318234 hartree
pointgroup: C01 [X(C10H12N4S2)]
dipole: -1.2917199 0.4899303 -0.9019165 debye
polarizability: 271.4359991|-1.9556269|152.4673196|5.8116363|-2.0838757|101.6741836 unknown
InChI: InChI=1S/C10H12N4S2/c1-15-10-8-9(11-5-12-10)14(6-13-8)7-3-2-4-16-7/h5-7H,2-4H2,1H3
charge 0 multiplicity 1
28 atoms
S  -3.505708 -0.252339 1.54178
S  3.865846 -1.591041 0.359978
N  -1.023169 -0.318071 0.214144
N  0.541573 -2.004833 0.234875
N  0.493723 1.639906 0.316815
N  2.852382 0.97448 0.389795
C  -2.31033 0.37917 0.170048
C  -3.066175 0.203361 -1.16903
C  -4.563959 0.447819 -0.898782
C  -4.949712 -0.425097 0.313013
C  0.227461 0.306987 0.278936
C  -0.76766 -1.700729 0.196553
C  1.186502 -0.754817 0.285606
C  2.547985 -0.35524 0.344715
C  1.833285 1.892348 0.374841
C  5.36964 -0.463135 0.45882
H  -2.094133 1.43928 0.379417
H  -2.914748 -0.828365 -1.539593
H  -2.6595 0.89666 -1.926784
H  -4.737092 1.513726 -0.659291
H  -5.180285 0.194636 -1.780877
H  -5.862268 -0.073927 0.818274
H  -5.059055 -1.487453 0.039043
H  -1.573566 -2.430024 0.1895
H  2.132895 2.943233 0.413499
H  5.319072 0.143303 1.373385
H  5.4003 0.19468 -0.420382
H  6.237496 -1.140417 0.479005
