program: Gaussian 09
title: 000245242
version: EM64L-G09RevD.01
frameworkgroup: C1[X(C16H14N6O4S)]
method: RPBEPBE
basis: SDD
operation: Freq
keyword: #p
keyword: freq=noraman
keyword: PBEPBE/SDD
title: #p freq=noraman PBEPBE/SDD
converged: YES YES NO NO
title: Mulliken charges:
elementType: S O O O O N N N N N N C C C C C C C C C C C C C C C C H H H H H H H H H H H H H H
charge: 0.866114 -0.542763 -0.542764 -0.225584 -0.225617 -0.051019 -0.051014 -0.286327 -0.286319 -0.322600 -0.322646 -0.059285 -0.059290 -0.271049 -0.271046 -0.218706 -0.218735 -0.369879 -0.369882 -0.327633 -0.327619 0.317809 0.317815 -0.241038 -0.241059 0.161588 0.161679 0.291868 0.291865 0.270740 0.270741 0.255874 0.255879 0.260709 0.260736 0.224455 0.224465 0.330424 0.330417 0.369345 0.369355
chargesum: 0.00000
title: Mulliken charges with hydrogens summed into heavy atoms:
elementType: S O O O O N N N N N N C C C C C C C C C C C C C C C C
charge: 0.866114 -0.542763 -0.542764 -0.225584 -0.225617 -0.051019 -0.051014 0.044097 0.044098 0.046745 0.046708 -0.059285 -0.059290 0.020819 0.020818 0.052034 0.052006 -0.114005 -0.114003 -0.066925 -0.066883 0.317809 0.317815 -0.016583 -0.016594 0.161588 0.161679
polarizability: 2.82079456e+02 2.57617815e-03 2.79366493e+02 1.60901462e+01 5.46118582e-03 1.97852922e+02
1716.lowfreq: -6.5179 -5.6197 -0.0003 0.0014 0.0015 6.9266 19.1203 28.2571 39.0326
frequency: 18.9769 28.2413 39.0200 51.0164 54.7238 58.8896 67.3516 92.2324 108.9021 131.7146 144.1390 151.9444 159.0206 206.9764 213.8307 218.1076 236.8058 236.8583 266.5012 276.6148 304.6790 324.6284 343.2576 357.8112 387.5845 394.9328 401.6732 403.7695 405.0962 409.5371 414.5574 459.1069 482.6686 504.5412 507.2508 528.5932 547.3389 551.2870 568.6661 586.7268 623.4753 624.6519 682.2408 695.2233 710.0774 712.9680 753.1927 756.3564 763.9237 787.4283 789.1489 808.8531 809.3854 827.2569 829.8881 845.5275 848.0859 910.1615 922.1726 925.4624 930.9935 941.5030 949.5254 951.7264 970.1204 972.8608 972.9811 988.4433 992.3839 1049.3599 1057.1486 1102.5397 1105.6623 1109.4064 1172.6067 1172.7980 1180.6353 1202.3007 1215.6711 1285.1073 1286.5262 1298.9770 1304.8478 1358.6938 1361.7638 1404.8310 1406.2736 1413.8406 1414.3963 1457.9697 1460.7313 1467.5284 1474.7557 1492.8121 1497.1466 1577.2501 1580.5296 1590.2322 1590.6585 1632.3634 1635.0477 1720.5287 1730.1567 3082.7151 3082.8760 3143.9583 3143.9759 3145.7210 3145.8714 3163.3771 3163.6130 3167.1248 3167.6291 3450.7902 3451.0158 3499.7147 3499.7787
redmass: 8.1618 6.4050 4.3667 7.1359 4.4713 9.0343 9.3258 9.6174 8.5664 8.4180 7.4376 4.7611 7.3428 5.5050 8.9477 5.1771 8.1386 6.2474 6.4351 4.7195 5.5002 5.2692 5.3867 5.7527 4.3573 2.5630 3.1661 2.0069 2.5631 2.2253 4.7961 11.7916 10.7362 7.0295 3.2872 4.3476 4.0754 4.4358 6.1613 6.8254 7.1209 7.1309 1.2262 1.2006 3.7743 3.4432 5.8409 5.4768 9.2063 9.1084 5.9293 3.5232 3.4625 1.4081 1.4520 1.7474 1.8568 3.0197 3.8976 2.2391 2.0509 3.7256 1.3404 1.3363 1.4071 3.5396 1.3335 4.8772 4.5032 2.5453 2.5549 3.8154 1.2950 1.3020 1.1544 1.8346 1.7002 2.9097 2.9471 1.2655 1.2631 3.3321 3.0156 5.3831 5.5066 4.0325 4.0175 1.2228 1.2248 1.8737 1.9261 1.9009 1.6094 1.3691 1.4876 7.8659 7.7056 6.2219 6.1230 7.2178 11.9784 9.2037 9.3939 1.0896 1.0896 1.0883 1.0884 1.0881 1.0883 1.0963 1.0963 1.0975 1.0976 1.0786 1.0778 1.0783 1.0783
irintensity: 0.1326 0.0333 0.0099 0.2261 0.0205 0.0642 0.1170 9.6247 1.6255 9.3350 1.9586 17.0476 1.5022 0.0582 0.9320 0.3404 2.4065 14.7023 0.1481 40.6866 7.5966 0.6279 0.2010 8.4701 42.5139 42.8466 1.0136 84.1962 3.4252 37.9015 9.5132 170.2799 2.0837 3.9075 22.3399 54.0309 24.7015 14.5879 0.0296 23.0527 1.1347 0.0852 13.4192 255.4638 4.6958 12.4849 1.7320 46.2232 4.8321 130.0688 0.3877 13.0686 9.0370 4.4324 35.6550 115.9647 20.2301 1.6626 23.5520 64.5036 6.3915 3.3650 0.7676 1.0234 1.1094 34.0092 0.4691 1.4709 2.1348 27.0815 29.6423 48.6678 0.1319 22.6496 69.2916 54.7018 16.2067 80.4161 0.0258 0.0191 5.6680 4.2570 48.6103 0.0661 3.7506 0.7867 9.3199 0.6486 12.0124 33.7275 0.3935 188.1860 60.4688 110.1436 1.7767 0.0005 10.7312 27.4389 126.5911 211.1987 69.7076 7.4353 807.1099 41.2262 60.3101 1.0434 2.8129 1.1864 0.0042 0.0492 8.0048 9.8218 6.0273 89.7751 0.8390 6.0058 39.4189
temp: 298.150 k
press: 1.00000 atm
elementType: 16 8 8 8 8 7 7 7 7 7 7 6 6 6 6 6 6 6 6 6 6 6 6 6 6 6 6 1 1 1 1 1 1 1 1 1 1 1 1 1 1
symmnumber: 1
zpe: 765974.0 jmol-1
zpe.correction: 0.291744 hartree
zpe.thermalcorrener: 0.316150 hartree
zpe.thermalcorrenthalpy: 0.317094 hartree
zpe.thermalcorrgfe: 0.236391 hartree
zpe.sumelectzpe: -1643.419057 hartree
zpe.sumelectthermal: -1643.394651 hartree
zpe.sumelectthermalent: -1643.393707 hartree
zpe.sumelectthermalfe: -1643.474409 hartree
dipole: 0.0132 -13.9507 -0.0003
dipole: 13.9507
quadrupole: -156.6494 -169.8008 -164.5248
quadrupole: 0.0077 9.6290 0.0039
quadrupole: 7.0090 -6.1425 -0.8665 0.0077 9.6290 0.0039
hfenergy: -1643.7108008 hartree
pointgroup: C01 [X(C16H14N6O4S1)]
dipole: 0.0036604 -5.4886149 0.0000977 debye
polarizability: 280.0691812|-0.0001696|279.3664897|20.5953836|0.0238821|199.8631999 unknown
InChI: InChI=1S/C16H14N6O4S/c23-15-16(24)22-20-10-18-12-3-7-14(8-4-12)27(25,26)13-5-1-11(2-6-13)17-9-19-21-15/h1-10,19-22H
charge 0 multiplicity 1
41 atoms
S  -0.00253 3.443071 -0.000168
O  0.036734 4.22446 1.439425
O  -0.042944 4.224012 -1.439972
O  -0.824901 -2.6093 1.600838
O  0.828879 -2.608213 -1.601025
N  -4.290874 -0.863799 -0.151142
N  4.292266 -0.857297 0.151889
N  -3.010326 -2.965119 -0.275187
N  3.014564 -2.960359 0.275033
N  -1.713055 -2.552624 -0.587201
N  1.716728 -2.549617 0.587022
C  -1.427358 2.203219 -0.013537
C  1.424161 2.205377 0.013517
C  -2.109165 1.987597 -1.220828
C  2.106309 1.991099 1.220855
C  -1.688388 1.475505 1.159539
C  1.68625 1.477746 -1.159373
C  -3.067252 0.953952 -1.270386
C  3.065964 0.958919 1.27066
C  -2.626534 0.429428 1.098697
C  2.625956 0.433089 -1.098272
C  -3.298365 0.139614 -0.126365
C  3.298288 0.144648 0.126839
C  -4.146073 -2.146558 -0.138034
C  4.149261 -2.140253 0.138419
C  -0.693224 -2.528236 0.347324
C  0.696979 -2.52614 -0.347604
H  -1.887625 2.616336 -2.090196
H  1.883813 2.619712 2.09007
H  -1.166813 1.711375 2.093134
H  1.16428 1.712578 -2.093008
H  -3.635702 0.764303 -2.186119
H  3.634697 0.770337 2.186436
H  -2.844577 -0.17226 1.98652
H  2.844829 -0.168543 -1.98593
H  -5.046008 -2.771991 -0.031793
H  5.050084 -2.76443 0.032315
H  -3.122617 -3.964611 -0.082666
H  3.128229 -3.959666 0.082366
H  -1.444044 -2.486839 -1.5783
H  1.447506 -2.48452 1.57811
