program: Gaussian 09
title: 000245216
version: EM64L-G09RevD.01
frameworkgroup: C1[X(C18H16N2)]
method: RPBEPBE
basis: SDD
operation: Freq
keyword: #pfreq=noraman
keyword: PBEPBE/SDD
title: #p freq=noraman PBEPBE/SDD
converged: YES YES NO NO
title: Mulliken charges:
elementType: N N C C C C C C C C C C C C C C C C C C H H H H H H H H H H H H H H H H
charge: -0.527751 -0.527747 0.497184 0.497195 -0.557157 -0.503233 -0.503230 0.448951 0.448951 -0.170662 -0.449035 -0.357315 -0.449031 -0.357320 -0.197936 -0.215500 -0.197937 -0.215507 -0.269102 -0.269101 0.309842 0.297411 0.297410 0.228259 0.228261 0.221653 0.224245 0.249756 0.224246 0.249764 0.223616 0.221128 0.223616 0.221128 0.227473 0.227473
chargesum: 0.00000
title: Mulliken charges with hydrogens summed into heavy atoms:
elementType: N N C C C C C C C C C C C C C C C C C C
charge: -0.230340 -0.230337 0.497184 0.497195 -0.247315 -0.274973 -0.274969 0.448951 0.448951 0.050991 -0.224789 -0.107559 -0.224785 -0.107555 0.025679 0.005628 0.025679 0.005621 -0.041629 -0.041628
polarizability: 2.77700423e+02 2.79724612e-03 2.90413348e+02 -8.20831183e-04 5.04241609e+00 1.08653478e+02
1716.lowfreq: -7.7951 -0.0005 -0.0003 0.0004 3.7765 7.2829 21.6348 30.6205 48.8377
frequency: 21.5446 30.6202 48.8119 59.4482 65.8817 108.7983 184.7588 207.1126 235.8428 237.1660 295.2373 301.2184 306.2680 365.1874 407.5433 408.6796 447.7911 481.7097 482.6516 508.4763 521.1907 565.6453 569.8735 594.2653 610.7663 614.3399 633.2111 652.4652 683.7047 692.3594 695.0503 731.1607 753.6387 759.8477 787.6405 821.2230 826.6871 834.6149 848.1801 856.2478 876.0090 887.6758 916.9856 952.7667 958.9837 965.4185 978.5114 978.9971 981.0716 982.8592 987.9978 991.9414 1024.3935 1026.1543 1086.5979 1088.4350 1096.1760 1169.6211 1170.8629 1176.3238 1182.9849 1185.8444 1189.6337 1243.6557 1265.8293 1283.7256 1299.2709 1326.9137 1334.9760 1373.4983 1387.4999 1390.0713 1421.5490 1435.2445 1470.6167 1475.6615 1486.4065 1493.5006 1516.5915 1523.0929 1590.5347 1594.2155 1603.8092 1607.1598 1619.9828 1627.7428 3112.6594 3112.7265 3120.1934 3127.3127 3127.8515 3129.5198 3140.2295 3140.4092 3154.9921 3160.4665 3160.7371 3171.0170 3171.6209 3180.6099 3542.5887 3542.5975
redmass: 4.0004 5.0254 4.6561 3.9824 4.4210 4.7104 4.6258 4.0961 4.6539 3.8595 3.7137 6.3430 5.1485 3.6044 2.9009 2.9190 2.5023 1.5964 1.9132 1.9813 1.8751 6.1100 5.9935 4.5945 6.1065 6.2382 6.4233 5.3847 1.9134 1.9345 2.2438 2.4146 1.7498 1.7712 2.2382 1.4655 1.3969 2.4623 1.6833 4.4387 1.4600 1.4780 1.3768 1.3324 1.3752 1.4233 1.3401 2.8897 4.7928 3.2006 1.9639 2.9484 2.1202 2.1354 1.5808 1.5432 1.6264 1.0543 1.0502 1.1333 2.0488 1.1057 1.1082 3.1906 1.5257 1.5556 1.9380 1.3439 1.5384 2.8232 5.2004 8.2602 3.1239 2.5409 3.2472 2.2770 2.3202 2.6955 1.9860 2.2943 6.6769 5.1046 3.7110 5.3165 6.0938 6.0063 1.0876 1.0876 1.0857 1.0864 1.0865 1.0917 1.0931 1.0931 1.0992 1.0954 1.0953 1.0981 1.0990 1.0918 1.0753 1.0753
irintensity: 0.0798 0.3631 1.0017 0.5536 1.3434 0.0355 1.0152 0.3156 9.6831 15.1486 7.4791 0.1220 0.0167 3.5766 0.2348 2.0673 48.5312 119.6777 83.3460 12.1145 25.1222 3.6609 4.4805 0.3115 3.0383 0.3877 1.1000 2.4442 68.3295 44.5706 21.4023 5.7241 28.5890 195.4222 24.9446 0.7975 2.4803 0.0001 0.0516 3.3144 27.4708 4.8488 1.8648 1.6034 0.1938 0.8851 1.9163 1.9420 0.0073 4.5177 0.0553 15.9081 4.5762 9.5239 8.7334 10.1925 8.8253 0.3735 0.5046 39.1073 9.7656 0.1395 20.6880 11.6841 8.4689 11.1392 112.4432 9.0708 44.6895 35.2425 35.0901 13.7378 62.0482 9.3252 23.7905 4.7816 111.4143 282.2248 40.9832 412.1789 62.7409 112.9327 211.0104 268.4852 154.5860 69.5613 0.0817 25.0899 2.6889 0.0034 2.7098 23.5609 24.1991 31.4549 35.7259 46.2988 30.8308 11.3440 0.6162 2.3632 17.3979 17.5325
temp: 298.150 k
press: 1.00000 atm
elementType: 7 7 6 6 6 6 6 6 6 6 6 6 6 6 6 6 6 6 6 6 1 1 1 1 1 1 1 1 1 1 1 1 1 1 1 1
symmnumber: 1
zpe: 763099.0 jmol-1
zpe.correction: 0.290649 hartree
zpe.thermalcorrener: 0.307047 hartree
zpe.thermalcorrenthalpy: 0.307991 hartree
zpe.thermalcorrgfe: 0.244787 hartree
zpe.sumelectzpe: -803.645986 hartree
zpe.sumelectthermal: -803.629588 hartree
zpe.sumelectthermalent: -803.628644 hartree
zpe.sumelectthermalfe: -803.691849 hartree
dipole: 0.0001 1.2120 0.5334
dipole: 1.3242
quadrupole: -101.1768 -103.5881 -122.7154
quadrupole: 0.0005 -0.0002 3.2118
quadrupole: 7.9833 5.5720 -13.5553 0.0005 -0.0002 3.2118
hfenergy: -803.9366353 hartree
pointgroup: C01 [X(C18H16N2)]
dipole: -0.000124 0.4713148 0.2220018 debye
polarizability: 277.7004224|-0.001555|290.0353969|0.0093923|9.694305|109.0314299 unknown
InChI: InChI=1S/C18H16N2/c1-3-8-15(9-4-1)19-17-12-7-13-18(14-17)20-16-10-5-2-6-11-16/h1-14,19-20H
charge 0 multiplicity 1
36 atoms
N  -2.482906 1.224764 0.23536
N  2.482483 1.226166 0.235647
C  -1.230729 1.859353 0.062411
C  1.229976 1.860061 0.062554
C  -0.000184 1.164161 0.195891
C  -1.227486 3.264204 -0.174679
C  1.225962 3.264906 -0.174556
C  -2.83446 -0.138617 0.109082
C  2.834751 -0.13704 0.109479
C  -0.000953 3.949694 -0.274019
C  -4.022409 -0.588193 0.755378
C  -2.094912 -1.064329 -0.679733
C  4.02286 -0.585985 0.755919
C  2.095729 -1.063165 -0.679342
C  -4.453091 -1.922918 0.620946
C  -2.530174 -2.401171 -0.796354
C  4.45422 -1.920503 0.621602
C  2.531665 -2.399798 -0.795843
C  -3.706263 -2.845768 -0.149191
C  3.70792 -2.843769 -0.14855
H  0.000107 0.11136 0.484499
H  -3.248201 1.84797 0.497918
H  3.247419 1.849788 0.498267
H  -2.17599 3.801753 -0.289753
H  2.174172 3.802993 -0.289533
H  -0.001253 5.030209 -0.455991
H  -4.59931 0.113859 1.371088
H  -1.208704 -0.73184 -1.226844
H  4.599348 0.116389 1.371648
H  1.209396 -0.731143 -1.226537
H  -5.369916 -2.245429 1.127468
H  -1.949105 -3.097863 -1.411723
H  5.371156 -2.242532 1.128229
H  1.9510 -3.096817 -1.411223
H  -4.036023 -3.885254 -0.245774
H  4.038205 -3.883097 -0.245041
