program: Gaussian 09
title: 000245202
version: EM64L-G09RevD.01
frameworkgroup: C1[X(C6H8N4O2)]
method: RPBEPBE
basis: SDD
operation: Freq
keyword: #pfreq=noraman
keyword: PBEPBE/SDD
title: #p freq=noraman PBEPBE/SDD
converged: NO YES NO NO
title: Mulliken charges:
elementType: O O N N N N C C C C C C H H H H H H H H
charge: -0.313398 -0.248482 -0.436584 -0.007121 -0.663099 -0.601107 0.143993 -0.601181 0.401364 -0.436032 0.283462 0.004334 0.277471 0.264608 0.362223 0.235988 0.320996 0.331456 0.335309 0.345800
chargesum: 0.00000
title: Mulliken charges with hydrogens summed into heavy atoms:
elementType: O O N N N N C C C C C C
charge: -0.313398 -0.248482 -0.074361 -0.007121 -0.010647 0.080002 0.143993 -0.059102 0.401364 -0.200044 0.283462 0.004334
polarizability: 1.30210309e+02 -5.38017491e+00 1.19956244e+02 -1.89083995e+00 1.19195490e+00 5.06470688e+01
1716.lowfreq: -12.0689 -5.2661 0.0003 0.0005 0.0006 4.5899 43.4872 63.8121 131.6853
frequency: 43.4197 63.7993 131.6842 148.8119 192.7375 210.3570 263.3979 284.8667 316.9493 366.5793 419.3022 473.0749 491.5324 528.9037 549.5751 563.3985 578.6560 586.3564 655.6460 673.6098 722.3804 738.8471 820.5095 829.3536 835.3183 889.2547 946.2584 978.1344 1002.2774 1064.5779 1066.1604 1169.9463 1176.6253 1243.8961 1269.1733 1287.3374 1385.5823 1420.6599 1432.6032 1473.2577 1567.9960 1592.3073 1609.2790 1636.1196 1647.2992 1656.1918 2988.7078 3096.8388 3175.3229 3233.8571 3515.7932 3562.9407 3669.3461 3706.2959
redmass: 3.9676 6.0873 5.5635 6.4302 4.0921 5.0146 1.0726 7.8962 3.6161 3.4586 1.1825 2.5935 3.3300 5.0184 1.5523 5.2102 2.0265 4.5519 3.1441 2.2609 3.4957 4.0230 2.4977 2.0478 1.3202 4.2159 2.3816 2.5168 3.6122 1.9027 1.6963 2.5471 1.3181 1.8358 2.2084 1.9530 3.8566 2.0505 1.1705 6.6375 4.7885 2.0669 2.9628 1.5617 2.0672 3.8965 1.0671 1.0933 1.0925 1.0838 1.0456 1.0459 1.1043 1.1044
irintensity: 6.3472 19.3044 18.5482 3.3370 5.5280 2.4941 79.1396 6.5349 2.5200 5.5175 219.5177 3.9467 5.9860 6.3805 56.8666 1.4778 118.7828 9.1009 36.8250 90.8548 8.7526 9.1855 15.0860 14.9722 173.2834 9.6408 25.8851 0.5880 13.0206 0.8133 0.5423 70.3580 4.9283 11.3052 17.4054 26.9372 238.7076 35.7722 26.7702 176.6993 375.4748 283.0739 233.3076 91.2348 185.4267 560.7057 3.3306 4.0737 8.5860 494.7368 58.8574 78.7261 36.2740 34.0611
temp: 298.150 k
press: 1.00000 atm
elementType: 8 8 7 7 7 7 6 6 6 6 6 6 1 1 1 1 1 1 1 1
symmnumber: 1
zpe: 394487.2 jmol-1
zpe.correction: 0.150252 hartree
zpe.thermalcorrener: 0.161534 hartree
zpe.thermalcorrenthalpy: 0.162478 hartree
zpe.thermalcorrgfe: 0.112708 hartree
zpe.sumelectzpe: -602.037676 hartree
zpe.sumelectthermal: -602.026394 hartree
zpe.sumelectthermalent: -602.025450 hartree
zpe.sumelectthermalfe: -602.075220 hartree
dipole: -7.1824 5.1466 0.1174
dipole: 8.8368
quadrupole: -62.2385 -68.8089 -70.4265
quadrupole: 30.2356 3.5577 -0.6676
quadrupole: 4.9195 -1.6509 -3.2686 30.2356 3.5577 -0.6676
hfenergy: -602.1879279 hartree
pointgroup: C01 [X(C6H8N4O2)]
dipole: 2.3444738 -2.5161505 -0.5094574 debye
dipolederiv: -0.9806243 -0.0278613 0.0430746 -0.3244637 -0.8978229 -0.1087144 0.0075368 -0.1788921 -0.4446054 -0.751147 0.4441106 0.0459752 0.4165559 -1.1508352 -0.121824 0.0191763 -0.0914451 -0.410382 -1.207355 -0.0849607 -0.2175683 0.1194496 -0.8476555 -0.1683386 -0.2207409 -0.1596065 -0.2858939 -1.1134753 0.422287 -0.0569917 0.3157098 -0.6310748 -0.0463342 -0.139619 -0.0015593 -0.2888923 -0.3595604 -0.3717052 0.0172043 -0.3252227 -1.2772902 -0.241736 0.0162861 -0.2801887 -0.7889667 -1.2704264 -0.2582314 -0.0137996 -0.1973756 -0.371603 0.1696675 0.1592812 0.1950788 -0.5900012 0.8760653 -0.1550204 0.130178 -0.1980109 0.9420525 0.1710009 0.268218 0.1803607 0.1650433 -0.3736471 0.1060111 0.0400286 0.2043603 -0.057571 -0.093282 0.0453048 -0.1320667 -0.067309 0.9621565 0.0062791 0.1802633 0.1525434 1.6655194 0.4394139 0.2317905 0.4267552 0.3509337 -0.2044374 0.0779771 0.0578392 0.0950196 -1.0790548 -0.1939123 0.0505875 -0.194831 -0.3370363 1.5770749 0.3160651 -0.2545825 0.4520039 0.9871143 0.1824515 -0.4488192 0.2358381 0.4246007 1.2221681 -0.4341973 0.1038672 -0.5096019 1.5425419 0.2562797 0.1071583 0.2534194 0.3094399 0.0438532 0.0146891 -0.0118693 0.0487856 0.0701025 0.0628187 -0.0243189 0.0365562 -0.0075205 0.0307685 -0.0344647 0.0225631 -0.0688094 -0.0251644 -0.010316 0.0390004 0.0130861 0.1216235 0.7721485 -0.0654651 -0.0282723 -0.2020514 0.2330719 -0.0411832 -0.0563539 -0.0620458 0.2768463 -0.0707478 -0.0400166 -0.0716801 -0.0462546 0.0790391 -0.0424094 -0.0748965 -0.0403454 0.1609656 0.1701334 0.024217 -0.061753 0.0478794 0.2369542 -0.0317062 -0.0551595 -0.0215079 0.3717274 0.181317 0.0842564 -0.0357875 0.0573299 0.2071425 -0.0340166 -0.0386053 -0.0286734 0.3739255 0.2665968 -0.0060099 0.0563385 0.0119533 0.1822584 -0.0774088 0.053244 -0.0699483 0.3312794 0.2291385 -0.0179598 0.0549724 -0.0498004 0.192275 -0.0704506 0.0609294 -0.0799844 0.334222 unknown
polarizability: 126.8880909|-8.7782963|117.7910527|5.4899144|17.8387302|56.134478 unknown
InChI: InChI=1S/C6H8N4O2/c7-3-1-6(12)10-5(9-3)2-4(8)11/h1,9H,2,7-8H2
charge 0 multiplicity 1
20 atoms
O  2.231877 -1.890413 -0.131317
O  -2.548335 2.406042 0.496229
N  -0.284867 -0.984569 0.15541
N  -0.455356 1.342617 0.736625
N  -2.064463 -2.294255 -0.680925
N  3.863779 -0.253077 -0.043901
C  0.231295 0.228798 0.612691
C  1.697599 0.212701 1.042627
C  -1.628244 -1.064191 -0.215253
C  -2.419991 0.072991 -0.096851
C  2.603992 -0.722865 0.234475
C  -1.871375 1.340716 0.386219
H  1.741715 -0.127196 2.097623
H  2.044699 1.257344 1.026652
H  0.4096 -1.745526 0.012956
H  -3.47882 0.046429 -0.367082
H  -1.453427 -3.106355 -0.710486
H  -3.029922 -2.401011 -0.977265
H  4.160189 0.685743 0.217439
H  4.513654 -0.859421 -0.546367
