program: Gaussian 09
title: 000245212
version: EM64L-G09RevD.01
frameworkgroup: C1[X(C16H20N4O)]
method: RPBEPBE
basis: SDD
operation: Freq
keyword: #p
keyword: freq=noraman
keyword: PBEPBE/SDD
title: #p freq=noraman PBEPBE/SDD
converged: YES YES NO NO
title: Mulliken charges:
elementType: O N N N N C C C C C C C C C C C C C C C C H H H H H H H H H H H H H H H H H H H H
charge: -0.268136 -0.308992 -0.153707 -0.153510 0.029656 0.412624 0.405388 0.416204 0.417797 -0.380597 -0.376615 -0.414684 -0.383945 -0.345406 -0.343884 -0.344481 -0.355179 -0.646559 -0.646560 -0.646587 -0.646510 0.259580 0.259012 0.263865 0.258493 0.236798 0.237785 0.238479 0.238979 0.232410 0.216822 0.233431 0.216062 0.232791 0.235738 0.235657 0.232562 0.217268 0.237496 0.216314 0.234142
chargesum: 0.00000
title: Mulliken charges with hydrogens summed into heavy atoms:
elementType: O N N N N C C C C C C C C C C C C C C C C
charge: -0.268136 -0.308992 -0.153707 -0.153510 0.029656 0.412624 0.405388 0.416204 0.417797 -0.121016 -0.117603 -0.150819 -0.125452 -0.108608 -0.106099 -0.106002 -0.116201 0.036105 0.038030 0.038900 0.041441
polarizability: 3.73702182e+02 -4.54923556e+00 2.25293155e+02 1.35832042e+01 1.07265164e+00 1.35184927e+02
1716.lowfreq: -7.5608 -2.0037 -0.0008 -0.0007 0.0003 3.4076 25.8990 33.3626 41.3655
frequency: 25.8732 33.3440 41.3482 54.9847 75.7744 84.4218 89.1381 97.8540 115.6626 127.2666 165.0315 181.4752 196.9912 202.3413 209.1345 226.7517 239.8003 260.8396 279.9664 327.3405 352.7813 374.0198 412.1374 416.7855 420.7525 441.0629 458.4899 476.3418 500.2824 513.6336 535.5666 539.2933 591.0152 627.9081 635.6553 662.7310 714.7217 718.2509 746.3272 765.0810 793.0465 797.5447 809.1215 813.4935 902.4999 929.1223 937.3019 940.5698 943.9112 948.0324 950.9870 956.3391 995.3474 1002.8464 1056.3504 1056.8395 1109.4026 1109.7655 1110.8178 1110.8210 1133.4507 1136.2518 1161.4693 1165.7424 1168.2636 1198.0015 1214.2100 1262.1161 1263.6932 1295.5595 1307.7226 1324.6078 1344.2223 1362.0154 1365.0611 1379.9999 1384.8553 1428.3859 1429.5827 1442.2462 1444.6851 1458.3466 1459.0073 1463.7563 1463.7691 1474.7660 1475.2782 1493.2558 1494.4956 1504.5476 1506.2689 1520.5033 1524.1283 1558.7203 1567.5928 1628.2753 1633.1978 2934.7100 2937.6053 2943.1782 2945.9197 2999.0527 3002.3361 3002.3551 3006.4330 3092.3778 3095.4081 3103.1500 3105.3793 3141.4893 3145.1207 3157.4043 3159.7073 3167.8242 3169.1964 3180.7532 3185.0914
redmass: 3.5131 4.3519 2.9835 5.3089 2.4317 2.6395 2.8298 2.2623 1.8929 2.6535 2.9719 3.4591 1.1942 1.2516 2.3522 3.0159 3.3157 3.5742 4.5684 4.1466 5.2051 4.9672 4.1169 2.9997 3.0971 3.2972 4.4392 3.5684 3.7408 3.2178 3.0405 2.9629 4.2050 6.5259 6.8453 5.6612 3.6328 3.7535 5.5189 6.0712 1.2784 1.3135 1.7669 1.8514 3.4728 1.5533 2.0232 2.2321 2.6094 1.5509 1.3717 4.2719 3.0561 2.5408 1.4928 1.4884 1.2392 1.2649 1.3186 1.2929 1.4323 1.4161 2.3727 1.6786 1.6733 1.1243 1.3118 2.8567 2.9159 3.7416 1.8868 1.4189 3.2373 3.1658 3.7389 6.5572 6.3779 1.4600 1.3398 2.1408 2.4576 1.2183 1.2231 1.0408 1.0410 1.0463 1.0459 1.0930 1.0962 1.2016 1.1674 2.2620 2.2541 6.9561 7.3268 6.0830 6.2283 1.0369 1.0370 1.0395 1.0395 1.0993 1.0998 1.1024 1.1023 1.0961 1.0960 1.0939 1.0939 1.0882 1.0877 1.0874 1.0877 1.0945 1.0948 1.0960 1.0964
irintensity: 0.8874 2.2715 0.1065 0.3117 0.0352 0.1844 1.8541 7.3323 0.7984 0.0670 3.9293 0.5333 0.0750 0.2845 1.1002 2.7227 2.0840 1.0338 5.6821 1.7479 3.0387 1.0284 3.0070 0.2075 0.2733 0.8562 1.4320 2.4755 9.9494 3.7888 19.0052 19.7844 6.8615 0.2702 0.6844 22.5326 1.3388 1.3795 12.2344 18.6030 1.4020 2.5354 21.2480 99.6654 110.3309 12.4308 9.1149 44.3633 15.6274 24.2630 3.2406 33.9335 1.7318 6.0906 27.3127 27.8298 0.0144 0.6214 0.8896 1.1249 4.7376 6.2739 11.2858 12.4153 9.1265 93.1986 24.0968 29.2278 30.0916 54.7078 90.8040 6.0528 174.3131 20.1719 209.4202 18.7707 28.4721 8.3437 4.3695 0.4817 0.2413 19.4221 38.1396 0.0758 0.3899 21.5186 21.8322 1.0429 1.6755 5.5320 11.4850 591.1372 99.2492 1.6372 8.8435 322.0866 151.8241 111.9682 105.9132 152.8525 96.7970 11.2191 22.1565 77.1504 71.3884 4.4257 4.0839 51.7101 48.8928 11.6205 8.7211 15.9836 14.6700 14.2376 15.4734 4.3408 3.5854
temp: 298.150 k
press: 1.00000 atm
elementType: 8 7 7 7 7 6 6 6 6 6 6 6 6 6 6 6 6 6 6 6 6 1 1 1 1 1 1 1 1 1 1 1 1 1 1 1 1 1 1 1 1
symmnumber: 1
zpe: 874020.9 jmol-1
zpe.correction: 0.332897 hartree
zpe.thermalcorrener: 0.354201 hartree
zpe.thermalcorrenthalpy: 0.355145 hartree
zpe.thermalcorrgfe: 0.281397 hartree
zpe.sumelectzpe: -914.304085 hartree
zpe.sumelectthermal: -914.282781 hartree
zpe.sumelectthermalent: -914.281836 hartree
zpe.sumelectthermalfe: -914.355585 hartree
dipole: 0.4608 -7.2161 -0.1262
dipole: 7.2319
quadrupole: -69.3092 -135.0051 -122.6530
quadrupole: 4.6096 4.1287 -1.0578
quadrupole: 39.6799 -26.0160 -13.6639 4.6096 4.1287 -1.0578
hfenergy: -914.6369818 hartree
pointgroup: C01 [X(C16H20N4O1)]
dipole: 0.1562983 -2.7757701 0.6050513 debye
polarizability: 372.7400997|-1.2674293|221.0727776|20.5920056|-19.1749537|140.3673866 unknown
InChI: InChI=1S/C16H20N4O/c1-18(2)13-5-9-15(10-6-13)20(17-21)16-11-7-14(8-12-16)19(3)4/h5-12H,1-4H3
charge 0 multiplicity 1
41 atoms
O  -0.933329 3.449629 -0.842316
N  0.049535 1.413382 -0.471847
N  5.068608 -1.219828 0.210758
N  -4.958032 -1.256573 0.144032
N  0.174486 2.810358 -0.735974
C  1.304888 0.741624 -0.270846
C  -1.210684 0.728211 -0.336628
C  3.835559 -0.577382 0.049505
C  -3.729723 -0.607853 -0.013306
C  1.467957 -0.612695 -0.655492
C  -1.433843 -0.139574 0.762336
C  2.415472 1.434799 0.274331
C  -2.259224 0.934331 -1.268348
C  2.702399 -1.264219 -0.49294
C  -2.661309 -0.802381 0.921772
C  3.654864 0.79197 0.42804
C  -3.491089 0.277196 -1.113562
C  5.221837 -2.623722 -0.186326
C  6.216467 -0.480799 0.748581
C  -5.18322 -2.134729 1.298149
C  -6.03869 -1.02816 -0.822939
H  0.62322 -1.157756 -1.088917
H  -0.635087 -0.296414 1.495174
H  2.298103 2.478704 0.57618
H  -2.111268 1.605711 -2.117176
H  2.784627 -2.309412 -0.803255
H  -2.790266 -1.464506 1.782283
H  4.485335 1.359925 0.856048
H  -4.275345 0.463418 -1.85209
H  4.527564 -3.286929 0.369563
H  6.249607 -2.955797 0.029585
H  5.037171 -2.771534 -1.270666
H  7.092913 -1.146461 0.793402
H  6.022165 -0.106035 1.774596
H  6.482489 0.389702 0.114027
H  -5.076096 -1.590271 2.258934
H  -4.475874 -2.989226 1.310832
H  -6.204689 -2.543998 1.253406
H  -6.342209 0.038265 -0.859673
H  -6.920664 -1.621318 -0.534284
H  -5.744725 -1.333752 -1.847745
