program: Gaussian 09
title: 000245236
version: EM64L-G09RevD.01
frameworkgroup: C1[X(C19H26O3S2)]
method: RPBEPBE
basis: SDD
operation: Freq
keyword: #p
keyword: freq=noraman
keyword: PBEPBE/SDD
title: #p freq=noraman PBEPBE/SDD
converged: NO YES NO NO
title: Mulliken charges:
elementType: S S O O O C C C C C C C C C C C C C C C C C C C H H H H H H H H H H H H H H H H H H H H H H H H H H
charge: 0.050006 0.082804 -0.247102 -0.186299 -0.224686 0.374472 -0.029907 -0.110140 -0.157698 -0.129325 -0.642513 -0.481341 -0.478785 -0.506152 0.373789 -0.532030 -0.560780 -0.860894 -0.490101 -0.529308 0.188853 -0.780301 -0.531011 0.174431 0.247508 0.222754 0.234367 0.312717 0.212595 0.233414 0.231491 0.212034 0.223698 0.214889 0.236120 0.229349 0.238787 0.276568 0.238426 0.242069 0.234347 0.279852 0.245213 0.236736 0.222622 0.249179 0.223854 0.230847 0.251415 0.253170
chargesum: 0.00000
title: Mulliken charges with hydrogens summed into heavy atoms:
elementType: S S O O O C C C C C C C C C C C C C C C C C C C
charge: 0.050006 0.082804 -0.247102 -0.186299 -0.224686 0.374472 0.217601 0.112614 -0.157698 0.105042 -0.329796 -0.035331 -0.035260 -0.067566 0.373789 -0.066561 -0.045426 -0.146052 0.034965 -0.069950 0.188853 -0.076421 -0.026427 0.174431
polarizability: 2.76859428e+02 -5.81505301e+00 2.16344283e+02 5.55849292e+00 8.75159403e-01 1.97902721e+02
1716.lowfreq: -0.0018 -0.0015 -0.0005 4.2284 13.3981 22.1089 32.2155 49.0770 58.6898
frequency: 31.9443 49.0570 58.5698 78.9799 86.4624 93.0805 112.8620 138.8729 158.9965 177.2053 184.6441 209.3081 216.1507 247.1732 275.8492 285.9358 300.3090 304.6975 324.0195 335.7157 339.8981 353.0271 365.8667 381.0199 402.1148 413.2044 424.4015 431.3583 441.2803 451.3126 460.0216 475.2553 478.5375 494.8864 514.2706 522.6872 553.3714 570.6241 581.5269 595.9771 641.0613 675.8898 692.2700 707.2073 740.3998 784.3200 789.5852 807.6145 819.3081 840.9708 846.3519 879.4764 895.3936 911.8530 924.0183 932.9006 946.4997 973.6711 982.5560 999.0724 1008.8763 1017.0654 1023.8080 1031.9697 1046.0478 1056.5870 1079.0178 1092.1186 1093.3949 1100.3458 1121.5191 1126.5345 1132.1148 1141.4427 1152.3143 1166.9618 1169.5379 1175.6990 1187.9202 1188.9510 1196.8385 1220.0870 1222.4194 1234.2844 1246.2920 1254.4335 1265.4890 1272.3577 1287.1252 1291.6734 1307.3259 1311.3305 1313.1264 1325.0501 1328.7972 1332.5850 1336.5930 1339.8499 1346.5471 1350.9894 1360.9476 1362.2244 1387.5382 1388.9632 1423.4315 1434.0134 1441.0071 1457.4804 1459.4721 1463.2266 1463.8468 1474.9218 1479.0982 1486.2769 1493.7691 1497.5367 1638.8771 1649.2296 2940.1466 2953.9698 2954.2810 2961.7958 2964.7870 2980.3931 2983.5265 2990.7842 2991.9450 2993.4972 2997.0893 2998.7830 3004.7162 3024.1463 3038.6096 3043.2584 3046.3438 3056.9774 3061.9878 3066.4742 3068.8801 3076.8249 3089.4234 3090.7943 3094.6757 3108.0623
redmass: 7.3521 4.1317 7.6944 7.2511 5.9067 2.8887 6.1921 2.4873 1.4861 1.3739 3.6003 2.3464 4.8120 2.9949 2.1723 3.0113 2.2678 3.5337 3.8818 2.8812 3.8728 2.8989 3.3417 3.8173 4.6166 5.0947 4.3198 5.6743 3.7082 3.8621 2.2652 3.4055 3.2989 3.2681 2.7529 2.8905 3.4429 4.0442 2.7693 3.7200 4.2740 3.6226 3.6435 3.0716 2.8688 3.2714 3.2515 2.2939 1.7417 1.9795 1.9490 3.1289 2.2875 1.9987 1.7130 2.3779 1.7452 2.1026 2.2001 2.2669 2.2384 1.9099 1.8887 1.9388 2.0905 2.5909 2.8753 1.6379 2.3385 2.3581 2.3876 2.2018 2.2688 2.1163 1.7384 1.8324 1.8758 1.6955 2.0360 1.7512 2.1746 1.6479 1.7864 1.5502 1.3481 1.7063 1.4900 1.5410 1.8523 1.3270 1.5140 1.4343 1.4144 1.5079 1.4260 1.3153 1.4072 1.4120 1.4449 1.3691 1.5082 1.4905 1.2217 1.1837 1.0734 1.0775 1.0759 1.0757 1.0714 1.0827 1.0644 1.0870 1.0717 1.0577 1.0725 1.0525 10.4406 12.1101 1.0794 1.0825 1.0675 1.0638 1.0675 1.0672 1.0615 1.0665 1.0724 1.0499 1.0617 1.0511 1.0379 1.0957 1.0909 1.0926 1.1016 1.0953 1.1028 1.0912 1.0978 1.0916 1.0984 1.0987 1.0990 1.0961
irintensity: 3.4867 4.8426 0.2130 0.4828 0.8163 3.8865 2.8601 0.2116 0.2865 0.3448 0.5753 0.1427 2.0969 0.0688 0.5507 0.3856 0.0944 2.5392 3.2095 1.3269 1.7611 3.1648 2.2160 2.7788 2.6633 0.9304 2.9327 1.3321 2.7256 1.3371 2.0355 2.9720 2.1076 0.3258 1.2933 3.6815 4.5940 2.8654 5.4878 0.6145 6.5525 1.7716 3.0399 7.2322 1.6700 3.8321 1.2169 0.4145 0.3731 2.4845 11.9440 24.2350 11.7789 10.4252 3.4216 49.8088 6.3147 20.3336 22.3352 23.9491 31.7589 1.4774 7.3407 12.9207 7.4731 59.5234 14.0505 42.3050 59.7678 24.0201 10.2985 18.7030 28.6304 15.9292 42.9920 14.7433 44.4535 24.4588 1.0740 5.4439 22.5970 4.6457 23.9200 6.7775 10.5548 11.3318 4.4672 2.3086 7.7025 2.8715 3.9794 1.6970 3.3456 9.2443 1.2321 4.0001 1.6655 3.3165 2.7130 2.5181 1.4620 1.7780 19.4739 30.3148 34.1803 10.3443 11.7494 18.4275 3.4365 20.8223 6.8552 12.7667 2.7876 11.9102 4.2764 1.1962 229.0229 345.3660 0.1031 18.9896 8.2789 33.6905 20.9115 15.0588 9.0419 13.4831 24.6599 1.6919 39.7569 18.5326 28.7491 22.8383 12.5333 18.1527 42.7257 26.5126 33.4164 4.4746 21.2204 4.2530 11.3913 37.9407 20.3597 32.5779
temp: 298.150 k
press: 1.00000 atm
elementType: 16 16 8 8 8 6 6 6 6 6 6 6 6 6 6 6 6 6 6 6 6 6 6 6 1 1 1 1 1 1 1 1 1 1 1 1 1 1 1 1 1 1 1 1 1 1 1 1 1 1
symmnumber: 1
zpe: 1091893.6 jmol-1
zpe.correction: 0.415880 hartree
zpe.thermalcorrener: 0.438267 hartree
zpe.thermalcorrenthalpy: 0.439211 hartree
zpe.thermalcorrgfe: 0.365957 hartree
zpe.sumelectzpe: -1759.595840 hartree
zpe.sumelectthermal: -1759.573454 hartree
zpe.sumelectthermalent: -1759.572510 hartree
zpe.sumelectthermalfe: -1759.645764 hartree
dipole: 1.0676 1.4333 5.4620
dipole: 5.7470
quadrupole: -232.2355 -148.5934 -158.2556
quadrupole: -16.2926 -2.6817 -2.4771
quadrupole: -52.5407 31.1015 21.4393 -16.2926 -2.6817 -2.4771
hfenergy: -1760.0117204 hartree
pointgroup: C01 [X(C19H26O3S2)]
dipole: 0.5995271 -0.5172831 -2.1178395 debye
polarizability: 277.3020767|5.2754838|216.1938977|1.4271778|1.8114375|197.6104576 unknown
InChI: InChI=1S/C19H26O3S2/c1-17-7-6-14-12(13(17)3-4-16(21)22-17)5-8-19-10-11(20)9-15(23-24-19)18(14,19)2/h12-15H,3-10H2,1-2H3
charge 0 multiplicity 1
50 atoms
S  2.286203 -1.162274 2.020488
S  2.395224 1.12294 2.334859
O  -4.093131 1.027284 0.211079
O  5.920316 -0.28513 0.309361
O  -6.192558 0.221678 0.568418
C  1.730381 0.374698 -0.314983
C  0.208584 0.482862 0.084693
C  -0.65708 -0.675424 -0.512454
C  2.299248 -1.039405 0.075536
C  -2.133671 -0.532423 -0.028619
C  2.616281 1.404035 0.462124
C  -0.072635 -2.052899 -0.108455
C  1.420892 -2.193276 -0.45791
C  -0.40233 1.872894 -0.237273
C  -2.722594 0.85211 -0.418391
C  -1.876121 1.969917 0.214699
C  3.775153 -1.229372 -0.349943
C  1.897376 0.628857 -1.845218
C  4.11356 1.329224 0.090146
C  -3.086696 -1.653613 -0.496315
C  4.703443 -0.085719 0.069677
C  -2.932709 1.0724 -1.931108
C  -4.486077 -1.468192 0.134905
C  -5.004467 -0.033301 0.284093
H  0.16399 0.365503 1.186591
H  -0.651853 -0.609011 -1.622286
H  -2.109954 -0.555177 1.084231
H  2.248226 2.43357 0.306198
H  -0.622734 -2.867925 -0.614202
H  -0.206433 -2.192486 0.982348
H  1.809518 -3.15966 -0.081686
H  1.548015 -2.221659 -1.560975
H  -0.334792 2.08826 -1.321003
H  0.166715 2.666524 0.28157
H  -1.940877 1.875434 1.315424
H  -2.302979 2.953533 -0.053891
H  3.840927 -1.32915 -1.455602
H  4.177418 -2.1670 0.070781
H  1.641978 1.673825 -2.09212
H  2.924819 0.451941 -2.198903
H  1.230247 -0.02466 -2.432307
H  4.718049 1.942402 0.779351
H  4.261543 1.75726 -0.924752
H  -2.702717 -2.645365 -0.200956
H  -3.154231 -1.659678 -1.60111
H  -3.373438 2.071067 -2.092735
H  -1.982699 1.019383 -2.490261
H  -3.625083 0.329687 -2.363089
H  -4.4820 -1.873689 1.16683
H  -5.262444 -2.0358 -0.407254
