program: Gaussian 09
title: 000245193
version: EM64L-G09RevD.01
frameworkgroup: C1[X(C10H10INO4)]
method: RPBEPBE
basis: SDD
operation: Freq
keyword: #p
keyword: freq=noraman
keyword: PBEPBE/SDD
title: #p freq=noraman PBEPBE/SDD
converged: YES YES NO NO
title: Mulliken charges:
elementType: I O O O O N C C C C C C C C C C H H H H H H H H H H
charge: 0.038639 -0.408617 -0.241220 -0.421863 -0.334434 -0.453713 0.553945 -0.596158 -0.492303 -0.366487 0.107878 0.194150 0.219709 -0.312409 -0.739237 0.168809 0.253329 0.264540 0.263804 0.323374 0.311735 0.271519 0.306038 0.306465 0.390433 0.392072
chargesum: 0.00000
title: Mulliken charges with hydrogens summed into heavy atoms:
elementType: I O O O O N C C C C C C C C C C
charge: 0.038639 -0.018184 -0.241220 -0.029791 -0.334434 -0.130339 0.553945 -0.342828 0.036042 -0.054752 0.107878 0.194150 0.219709 -0.040890 -0.126734 0.168809
polarizability: 2.94106700e+02 7.62007945e+00 1.41942387e+02 1.60185632e-01 3.42879663e-02 6.34666759e+01
1716.lowfreq: -40.4264 -5.3152 -1.5301 -0.0004 -0.0003 0.0004 2.6969 20.8112 47.8834
frequency: -40.1383 20.7737 47.8813 56.8702 76.9606 111.3265 111.5964 137.2775 169.5729 236.5492 238.1075 278.8718 292.9494 318.5637 378.4535 438.4952 449.4684 502.6901 530.7935 559.4943 569.2617 571.6401 612.4248 618.7002 675.8964 687.4437 710.9991 723.3864 749.0215 753.0750 770.2686 851.3490 856.8689 874.9760 907.9767 936.3869 965.6572 996.8907 1024.6358 1069.6073 1116.7516 1122.4772 1150.3476 1175.3471 1196.8645 1212.5215 1239.1123 1274.5163 1307.2148 1310.4200 1319.0570 1366.6812 1403.8873 1445.0653 1448.0899 1450.8182 1495.3501 1497.9241 1583.1235 1586.9855 1626.9233 1659.6739 2988.7499 3013.7515 3043.5423 3086.1720 3147.5051 3168.8543 3172.4113 3209.9694 3513.6154 3531.5297
redmass: 1.9801 8.7497 9.1250 8.0766 4.3388 12.7538 7.2911 5.8179 8.0591 5.5540 5.9631 8.7481 4.8236 6.6640 6.2551 9.9438 2.7780 6.4524 5.8512 2.7382 6.4721 1.2508 5.5057 2.4504 1.7821 2.5151 5.2264 4.9867 1.2863 3.1665 5.9313 1.2030 1.3776 1.6576 5.9726 1.4681 3.9943 1.3134 5.1230 3.7817 1.2260 1.7451 1.8414 1.5586 1.3842 1.5182 1.7404 1.1436 1.6144 2.5439 1.9587 4.0802 6.3910 1.1971 1.1245 2.2299 3.5093 2.0830 4.7236 4.7115 4.4741 5.1201 1.0596 1.0688 1.1010 1.0569 1.0922 1.0910 1.1105 1.0953 1.0763 1.0641
irintensity: 0.1276 0.0257 0.1826 4.0625 9.4650 1.7548 0.8109 0.0458 8.7798 0.9937 6.9522 0.1055 0.4948 4.0253 19.3987 15.2863 24.9875 44.0220 2.7328 1.8086 2.9902 116.4694 71.0971 0.4176 92.7560 7.9009 0.7316 8.1889 19.7556 0.2628 1.7890 182.7847 42.6883 35.5921 27.5897 0.0245 22.5279 1.1518 319.0845 9.2582 1.6978 111.3225 129.7321 72.6939 80.4518 112.6818 24.0316 0.7200 71.8092 147.3712 103.2676 572.3644 31.2120 42.5290 10.8464 178.7250 288.1258 241.6118 21.2103 256.3562 169.6451 410.3470 20.9823 294.9681 6.3350 3.4854 5.1323 1.1817 1.9205 6.7906 15.6321 84.1740
temp: 298.150 k
press: 1.00000 atm
elementType: 53 8 8 8 8 7 6 6 6 6 6 6 6 6 6 6 1 1 1 1 1 1 1 1 1 1
symmnumber: 1
zpe: 494945.4 jmol-1
zpe.correction: 0.188515 hartree
zpe.thermalcorrener: 0.203192 hartree
zpe.thermalcorrenthalpy: 0.204136 hartree
zpe.thermalcorrgfe: 0.143414 hartree
zpe.sumelectzpe: -753.089872 hartree
zpe.sumelectthermal: -753.075195 hartree
zpe.sumelectthermalent: -753.074251 hartree
zpe.sumelectthermalfe: -753.134973 hartree
dipole: -0.5703 0.4599 0.0011
dipole: 0.7326
quadrupole: -113.4077 -110.5631 -109.5198
quadrupole: 16.4093 0.0128 0.0290
quadrupole: -2.2442 0.6004 1.6437 16.4093 0.0128 0.0290
hfenergy: -753.2783868 hartree
pointgroup: C01 [X(C10H10I1N1O4)]
dipole: -0.2327652 0.1699147 -0.0057142 debye
dipolederiv: -0.4629126 -0.0269939 -0.0023436 -0.1409978 -0.1221397 -0.0005361 -0.0002401 0.0002607 -0.0897238 -0.8941586 0.4607622 -0.0157732 0.4496601 -0.8817603 0.0159441 -0.0157939 0.0159084 -0.3964869 -0.860894 -0.0696124 -0.003335 0.7196242 -0.8466206 0.0195409 -0.02236 0.0118105 -0.3147259 -0.6712963 -0.4265875 0.0078039 -0.8570378 -1.1421737 0.0088525 0.0182076 0.0133215 -0.4150807 -1.3605369 0.1834908 -0.0147533 0.3503222 -0.7889266 0.0139997 -0.0187428 0.0121312 -0.3631955 -2.5230149 0.2254593 -0.0264776 0.3540696 -0.3642894 0.004724 -0.0291678 0.0030518 -0.3154775 1.716878 -0.0475723 0.0165799 0.5815998 0.445959 -0.0016248 0.0012294 -0.0076895 0.1375369 -0.848795 0.3737801 -0.0146942 0.1873833 -0.0701184 -0.0021648 -0.0103162 -0.0003046 -0.2444657 -0.4050411 -0.0594724 -0.0031261 -0.5841638 -0.1512603 0.0001178 0.0043578 0.0039535 0.1186599 -0.7168001 -0.2155363 -0.0000578 -0.4853896 -0.2730875 -0.0031291 0.0062227 -0.0004585 -0.2020873 -1.4688888 -0.2870705 -0.007284 0.0236956 -0.3349603 0.006522 -0.014877 0.0032406 -0.0709527 1.1250859 -0.5906908 0.0238929 -0.1710578 0.7534435 -0.016553 0.0140755 -0.0207265 0.1235811 2.1367411 -0.1401123 0.0224753 -1.114969 1.094866 -0.0323556 0.0478357 -0.0221243 0.1875906 0.7444246 0.1709882 0.0041099 -0.2793956 0.0596732 -0.0058923 0.0148691 -0.0013436 -0.0679181 0.799349 0.2196731 0.0017859 0.3609895 0.1504831 0.0008262 -0.000289 0.0000323 0.0405821 2.5171208 0.3151955 0.0155869 0.4925173 1.4303539 -0.0235727 0.0114662 -0.0252083 0.2601759 0.0465732 -0.0681673 0.0002219 -0.0823878 -0.0230598 0.0040093 0.0005134 0.0041618 0.1830645 0.0192359 0.0010182 0.021183 0.0573634 0.0211031 -0.080139 0.0322705 -0.0884095 -0.0050762 0.0203427 -0.0004172 -0.0215468 0.0557692 0.0264332 0.0804364 -0.0339314 0.0877909 -0.0119769 0.1824607 0.0125833 -0.0014699 -0.0248504 0.1077305 0.0043302 -0.0004011 0.0048617 0.2984222 0.1587708 0.0543415 -0.0015801 0.0292319 0.0782385 0.0027847 -0.0009414 0.0030312 0.1853679 0.0948377 -0.0375434 0.0003241 -0.0307235 0.0038436 0.0031904 0.0001679 0.0031363 0.1517059 -0.0409779 -0.0859511 -0.0364505 -0.0246015 0.0146981 -0.0699615 0.0110056 -0.0526186 0.0196662 -0.0404883 -0.0854247 0.038418 -0.0256957 0.0191699 0.0693744 -0.0109015 0.0511409 0.0166133 0.5025593 0.041757 0.0003385 -0.0276392 0.4467548 -0.0020581 0.0021278 -0.001195 0.3710544 0.2294251 0.0821028 -0.0038282 0.1866835 0.3456462 0.0033344 -0.0063869 0.002245 0.4031464 unknown
polarizability: 293.0115591|14.8887802|142.9794949|1.8852307|-1.7084986|63.5247089 unknown
InChI: InChI=1S/C10H10INO4/c11-4-3-9(14)12-6-1-2-7(10(15)16)8(13)5-6/h1-2,5,12-13,15H,3-4H2
charge 0 multiplicity 1
26 atoms
I  7.144407 0.579663 0.021209
O  -2.93758 2.193996 -0.107479
O  2.624449 -1.521832 0.035298
O  -4.434987 -1.787651 -0.028307
O  -4.889917 0.482612 -0.088144
N  1.59002 0.592423 -0.024403
C  0.208577 0.265149 -0.030236
C  -0.703828 1.345923 -0.064722
C  4.044037 0.491826 0.002173
C  -0.263755 -1.08448 -0.003192
C  -2.582672 -0.248241 -0.046331
C  -2.09324 1.105673 -0.073223
C  2.698695 -0.260598 0.006444
C  -1.643559 -1.315999 -0.011568
C  5.211324 -0.500724 0.026488
C  -4.025484 -0.46117 -0.05643
H  -0.363755 2.387036 -0.085756
H  4.096126 1.164927 0.880095
H  4.107527 1.135007 -0.897146
H  1.799427 1.594506 -0.046216
H  0.452098 -1.905784 0.023149
H  -2.025163 -2.340924 0.008843
H  5.234156 -1.14608 -0.861597
H  5.222163 -1.116108 0.935799
H  -3.899472 1.849735 -0.109527
H  -5.429095 -1.820186 -0.037821
