program: Gaussian 09
title: 000245203
version: EM64L-G09RevD.01
frameworkgroup: C1[X(C15H12F3N3)]
method: RPBEPBE
basis: SDD
operation: Freq
keyword: #p
keyword: freq=noraman
keyword: PBEPBE/SDD
title: #p freq=noraman PBEPBE/SDD
converged: YES YES NO NO
title: Mulliken charges:
elementType: F F F N N N C C C C C C C C C C C C C C C H H H H H H H H H H H H
charge: -0.170648 -0.175486 -0.170664 -0.456279 -0.390668 -0.067827 0.176349 -0.539087 0.289664 0.004554 0.473728 -0.369941 -0.341045 -0.371111 -0.418294 0.284764 -0.364969 -0.315798 -0.210802 -0.231376 0.252429 0.241425 0.277350 0.340076 0.304547 0.237352 0.249345 0.257049 0.229894 0.261024 0.260705 0.226248 0.227490
chargesum: 0.00000
title: Mulliken charges with hydrogens summed into heavy atoms:
elementType: F F F N N N C C C C C C C C C C C C C C C
charge: -0.170648 -0.175486 -0.170664 -0.116203 -0.086121 -0.067827 0.176349 -0.020312 0.289664 0.004554 0.473728 -0.132588 -0.091699 -0.114062 -0.188400 0.284764 -0.103945 -0.055094 0.015446 -0.003886 0.252429
polarizability: 2.69644407e+02 -5.78232217e+00 1.78428963e+02 4.14315403e+00 1.99631709e+00 1.16128470e+02
1716.lowfreq: -10.1380 -4.8296 -0.0003 0.0005 0.0007 2.2330 13.9431 19.2603 21.4053
frequency: 13.7325 19.1243 21.3636 51.8132 75.4204 103.3387 134.9049 167.0950 189.2167 247.6086 251.9228 273.8765 300.4925 345.7106 364.5291 371.6425 411.8798 430.5212 445.1308 467.1037 480.0562 500.6805 518.2373 552.3660 562.6336 574.3045 582.5867 613.3402 629.4016 636.8626 655.2153 673.8972 724.2433 733.0413 757.1175 772.0976 792.0411 814.8608 822.8692 828.4315 859.9325 878.8495 939.8998 946.8874 954.7920 964.9998 965.5061 978.7329 982.4408 984.3723 1008.3174 1018.2651 1023.7055 1075.5442 1111.1630 1139.8345 1159.9905 1196.4512 1205.9471 1217.1918 1233.7748 1259.8195 1291.7362 1297.7691 1304.0943 1321.4635 1338.1470 1368.2450 1386.1080 1414.4279 1436.9407 1441.8867 1468.8538 1475.8827 1481.8767 1518.6016 1534.8991 1580.1503 1594.0272 1633.2970 1634.5133 2998.7746 3084.6934 3128.8299 3132.5576 3143.0849 3145.3435 3160.1359 3163.7457 3167.2905 3173.2402 3559.3005 3562.6389
redmass: 8.6551 6.5923 6.9730 4.1300 7.1902 7.0741 6.1496 7.3116 6.7800 5.3420 4.6412 5.3228 4.7859 4.4478 7.0959 6.4524 2.9988 2.9452 4.9985 1.7810 2.7925 3.4664 8.2130 3.7349 3.2685 6.3602 3.7590 6.7005 6.4780 1.4653 2.9132 8.4116 4.8985 3.9652 1.3754 3.6475 4.7719 2.5177 1.5485 1.8356 1.5044 5.7065 1.3817 1.8536 4.1037 1.4086 3.2339 1.3078 5.5845 2.6179 2.1484 6.9065 3.3163 3.6826 1.6375 1.3755 1.1524 1.1310 2.5816 1.5476 1.2722 2.6963 2.6567 2.0659 2.1914 1.5607 1.5751 3.3305 2.6465 3.0197 3.8927 3.3559 1.1337 3.3099 1.7479 4.4686 3.4078 4.8299 6.9096 7.4426 6.4311 1.0667 1.0954 1.0894 1.0855 1.0876 1.0904 1.0960 1.0953 1.0967 1.0993 1.0822 1.0773
irintensity: 0.7722 1.9809 2.1115 0.8548 0.5467 3.0177 2.0962 0.2360 1.6552 0.9092 4.1278 1.1661 6.1728 6.5298 2.7148 2.9723 2.9889 9.0748 7.8970 80.2426 23.4615 27.0554 5.9884 15.7444 18.8280 23.2544 1.3925 0.2856 3.8265 40.5345 16.7407 4.5776 19.4183 4.0035 104.5008 5.0525 5.0426 0.8270 5.9796 124.0615 0.1259 0.0392 3.2522 87.9548 2.8231 9.0728 142.1665 0.0155 84.9312 10.4651 13.3870 146.3623 137.9535 21.2543 5.0912 1.0052 1.5774 67.8237 37.4411 58.6717 25.3808 23.4093 295.0936 253.4767 32.1649 55.6544 11.6199 55.2925 64.5488 1.2994 2.4851 29.2886 22.2056 5.3980 31.0617 13.8446 114.0148 13.7907 4.1425 5.0649 348.1561 23.4651 4.7511 9.5328 0.7161 12.3965 10.7408 20.7551 8.9250 1.1978 20.4145 91.7192 61.5970
temp: 298.150 k
press: 1.00000 atm
elementType: 9 9 9 7 7 7 6 6 6 6 6 6 6 6 6 6 6 6 6 6 6 1 1 1 1 1 1 1 1 1 1 1 1
symmnumber: 1
zpe: 639761.0 jmol-1
zpe.correction: 0.243672 hartree
zpe.thermalcorrener: 0.261033 hartree
zpe.thermalcorrenthalpy: 0.261977 hartree
zpe.thermalcorrgfe: 0.194897 hartree
zpe.sumelectzpe: -1041.123928 hartree
zpe.sumelectthermal: -1041.106567 hartree
zpe.sumelectthermalent: -1041.105623 hartree
zpe.sumelectthermalfe: -1041.172703 hartree
dipole: 2.2712 -1.7693 -0.9944
dipole: 3.0459
quadrupole: -150.8868 -114.7328 -117.5936
quadrupole: 14.4598 1.0689 4.3510
quadrupole: -23.1491 13.0049 10.1442 14.4598 1.0689 4.3510
hfenergy: -1041.3676001 hartree
pointgroup: C01 [X(C15H12F3N3)]
dipole: -0.7887547 -0.8318518 0.3491851 debye
polarizability: 265.6018587|18.7922774|182.1708422|8.5326254|0.9425247|116.4291388 unknown
InChI: InChI=1S/C15H12F3N3/c16-15(17,18)10-5-7-11(8-6-10)19-9-14-20-12-3-1-2-4-13(12)21-14/h1-8,19-20H,9H2
charge 0 multiplicity 1
33 atoms
F  4.794492 2.195379 -1.250585
F  4.005314 3.083964 0.67546
F  5.576058 1.45682 0.756755
N  -1.944317 0.029645 -0.179915
N  0.217808 -2.070673 0.310325
N  -3.336762 -1.756127 -0.478267
C  -2.058687 -1.344809 -0.438915
C  -0.866805 -2.247877 -0.663603
C  -3.244006 0.541331 -0.039259
C  -4.107035 -0.591732 -0.237999
C  1.22667 -1.11704 0.220113
C  -3.74111 1.832411 0.233822
C  -5.509535 -0.433025 -0.16548
C  1.351224 -0.235337 -0.900068
C  2.186756 -1.008437 1.27597
C  3.333905 0.804082 0.099035
C  2.395211 0.704954 -0.954025
C  3.217424 -0.062364 1.216793
C  -5.144375 1.968752 0.301212
C  -6.014327 0.855482 0.104606
C  4.399817 1.846267 0.065886
H  -0.462351 -2.11742 -1.685475
H  -1.244341 -3.282113 -0.609297
H  -1.068457 0.544241 -0.081197
H  0.150131 -2.60381 1.177477
H  -3.081665 2.692975 0.386631
H  -6.171403 -1.291053 -0.316319
H  0.654668 -0.298425 -1.741796
H  2.115488 -1.679588 2.140063
H  2.485027 1.361097 -1.825762
H  3.945115 0.000295 2.031944
H  -5.576693 2.953648 0.509265
H  -7.097039 1.009487 0.165705
