program: Gaussian 09
title: 000245192
version: EM64L-G09RevD.01
frameworkgroup: C1[X(C12H15Cl2NO2S)]
method: RPBEPBE
basis: SDD
operation: Freq
keyword: #p
keyword: freq=noraman
keyword: PBEPBE/SDD
title: #p freq=noraman PBEPBE/SDD
converged: YES YES NO NO
title: Mulliken charges:
elementType: Cl Cl S O O N C C C C C C C C C C C C H H H H H H H H H H H H H H H
charge: -0.055301 -0.055962 0.210932 -0.422680 -0.225452 -0.173167 -0.390220 -0.391145 0.459562 -0.358063 -0.349192 -0.584028 -0.583624 -0.199488 -0.273678 -0.256319 -0.728803 0.276975 0.249220 0.250879 0.250562 0.249213 0.234721 0.235723 0.268656 0.291338 0.268981 0.292802 0.283191 0.253581 0.293737 0.292754 0.384294
chargesum: 0.00000
title: Mulliken charges with hydrogens summed into heavy atoms:
elementType: Cl Cl S O O N C C C C C C C C C C C C
charge: -0.055301 -0.055962 0.210932 -0.038386 -0.225452 -0.173167 0.109879 0.108630 0.459562 -0.123342 -0.113468 -0.024034 -0.021841 0.083703 -0.020097 -0.256319 -0.142312 0.276975
polarizability: 2.86284431e+02 1.75637593e+00 1.91842944e+02 -2.23591146e-01 1.71890447e+01 1.08207173e+02
1716.lowfreq: -4.2393 -1.3039 -0.0019 0.0009 0.0021 5.9084 13.9583 29.0264 32.3593
frequency: 13.6843 28.9900 32.1605 34.3028 43.8108 57.0133 62.0345 84.3475 107.0729 129.1460 154.6111 159.4680 204.9351 212.8718 215.3943 242.2300 291.5477 334.7115 339.0871 382.7626 397.9116 412.2830 460.6288 499.7889 514.7835 537.7120 570.1624 599.8778 628.2072 636.8582 672.7716 695.2850 714.0226 728.3678 756.3880 781.5324 790.0611 810.2100 819.7959 826.2128 889.6196 944.3389 952.1436 963.5702 987.0374 998.7519 1034.6356 1034.8628 1041.3406 1054.8567 1085.9234 1120.0971 1133.9071 1170.7791 1181.2513 1212.0804 1223.2084 1228.8763 1257.2104 1258.9123 1277.1598 1294.2799 1304.1547 1315.3328 1353.7794 1357.7542 1363.3804 1386.8714 1418.1451 1423.4436 1459.1675 1460.1815 1482.7929 1493.1274 1503.6929 1559.0314 1609.9121 1663.9432 3013.6775 3019.2712 3061.8560 3063.5047 3068.0647 3069.7574 3075.2794 3142.6755 3146.2256 3147.0997 3148.5230 3156.7505 3164.4604 3168.9279 3515.4842
redmass: 9.3228 15.0806 11.0491 8.7441 11.4016 6.5920 3.9479 3.8599 2.9786 2.6696 6.0586 5.1608 7.0125 6.0649 5.9837 4.1894 5.4969 4.1491 5.0274 3.6585 2.9933 3.0671 3.1236 4.1159 2.9420 4.5411 2.8808 4.8606 3.8633 1.9680 6.2528 5.2683 3.5850 5.8163 4.6885 1.1287 1.1705 1.3066 1.7185 3.7916 2.0658 1.3269 2.7696 1.3824 4.1631 1.4288 2.9711 2.6941 2.3305 1.7346 2.6863 1.5826 1.3536 1.2322 1.6047 1.1433 2.1164 1.1786 1.1627 1.1634 1.3441 1.1872 1.8577 1.5591 1.2546 1.4312 5.0277 1.7181 1.6798 1.6582 1.0922 1.0950 1.0888 2.2041 1.1683 6.9314 6.0373 8.5068 1.0601 1.0608 1.0577 1.0585 1.0569 1.1021 1.1035 1.0886 1.1090 1.0966 1.1046 1.1093 1.0952 1.0963 1.0639
irintensity: 0.4736 0.4488 1.0151 2.0790 0.5594 0.1580 3.8256 1.0004 1.5679 0.5554 0.7809 0.5004 2.3445 0.4914 2.7648 14.3295 4.0664 2.8621 1.2600 9.4907 9.9573 1.6163 1.2494 23.8041 37.3978 9.6390 48.8139 0.5473 27.7280 88.7089 72.9776 86.9103 4.8040 14.4165 2.6933 2.8456 10.6852 13.7731 66.8469 19.8417 7.4154 1.0803 21.8621 1.3840 2.3516 3.4944 0.2811 0.2218 1.2105 164.2816 2.3168 35.3105 6.6328 45.9453 69.1912 26.5028 36.8723 1.3514 17.1544 18.7082 45.6803 6.7397 38.6146 2.3075 0.7026 64.1722 0.9968 42.2674 8.1587 12.8851 14.8688 8.3014 28.0964 225.7282 73.2186 5.5149 203.8278 338.2112 24.2854 16.1945 13.2221 15.6121 5.2317 11.0485 9.4682 10.3263 2.1707 19.4464 9.5627 0.5746 14.0346 17.2535 26.6121
temp: 298.150 k
press: 1.00000 atm
elementType: 17 17 16 8 8 7 6 6 6 6 6 6 6 6 6 6 6 6 1 1 1 1 1 1 1 1 1 1 1 1 1 1 1
symmnumber: 1
zpe: 660602.7 jmol-1
zpe.correction: 0.251610 hartree
zpe.thermalcorrener: 0.271268 hartree
zpe.thermalcorrenthalpy: 0.272212 hartree
zpe.thermalcorrgfe: 0.198188 hartree
zpe.sumelectzpe: -1988.291350 hartree
zpe.sumelectthermal: -1988.271692 hartree
zpe.sumelectthermalent: -1988.270748 hartree
zpe.sumelectthermalfe: -1988.344773 hartree
dipole: 2.0642 0.5811 1.2642
dipole: 2.4893
quadrupole: -157.4433 -135.2847 -127.6684
quadrupole: -3.1834 -7.2569 0.1264
quadrupole: -17.3112 4.8474 12.4638 -3.1834 -7.2569 0.1264
hfenergy: -1988.5429604 hartree
pointgroup: C01 [X(C12H15Cl2N1O2S1)]
dipole: -0.8010275 -0.1923915 -0.529634 debye
polarizability: 283.5364664|18.9067078|157.4045008|5.5587756|-44.6282084|145.3935812 unknown
InChI: InChI=1S/C12H15Cl2NO2S/c13-5-7-15(8-6-14)10-1-3-11(4-2-10)18-9-12(16)17/h1-4,16H,5-9H2
charge 0 multiplicity 1
33 atoms
Cl -4.51588 -3.665317 1.320007
Cl -4.065266 2.92733 -1.947621
S  3.539758 -0.040974 1.433443
O  4.085135 1.609781 -1.493916
O  6.230483 1.170518 -0.717165
N  -2.42075 -0.307041 0.069089
C  -3.333644 -1.166339 0.841721
C  -3.010458 0.501754 -1.011404
C  -1.038663 -0.252714 0.359665
C  -0.16789 0.639983 -0.340896
C  -0.458717 -1.087461 1.364142
C  -3.350781 -2.600852 0.278998
C  -3.345816 1.922455 -0.517011
C  1.206075 0.703503 -0.041973
C  0.920119 -1.030991 1.646379
C  1.76419 -0.135277 0.950566
C  4.413998 -0.422571 -0.231364
C  5.033386 0.825288 -0.81178
H  -4.354998 -0.749057 0.793267
H  -3.05114 -1.182833 1.909215
H  -2.330962 0.55537 -1.880196
H  -3.936557 0.015587 -1.365901
H  -0.55562 1.309048 -1.114544
H  -1.069844 -1.800445 1.924763
H  -3.743186 -2.640972 -0.748028
H  -2.366455 -3.087408 0.333892
H  -4.117565 1.920039 0.267105
H  -2.455634 2.47152 -0.178471
H  1.847711 1.404551 -0.585148
H  1.342474 -1.695294 2.407665
H  3.65594 -0.853378 -0.900752
H  5.205943 -1.150549 -0.006576
H  4.529512 2.437543 -1.823467
