program: Gaussian 09
title: 000245178
version: EM64L-G09RevD.01
frameworkgroup: C1[X(C14H13N2O3P)]
method: RPBEPBE
basis: SDD
operation: Freq
keyword: #p
keyword: freq=noraman
keyword: PBEPBE/SDD
title: #p freq=noraman PBEPBE/SDD
converged: YES YES NO NO
title: Mulliken charges:
elementType: P O O O N N C C C C C C C C C C C C C C H H H H H H H H H H H H H
charge: 1.203992 -0.571201 -0.298072 -0.261986 -0.861605 -0.837531 0.408970 0.368284 -0.111562 -0.490736 -0.350498 0.300870 -0.262588 -0.298635 -0.370571 -0.219072 -0.206672 -0.219719 0.156550 -0.500007 0.335012 0.332524 0.272738 0.232240 0.266545 0.290581 0.268439 0.238679 0.238511 0.237129 0.227745 0.241414 0.240231
chargesum: 0.00000
title: Mulliken charges with hydrogens summed into heavy atoms:
elementType: P O O O N N C C C C C C C C C C C C C C
charge: 1.203992 -0.571201 -0.298072 -0.261986 -0.526592 -0.505007 0.408970 0.368284 -0.111562 -0.217998 -0.118258 0.300870 0.003958 -0.008054 -0.102133 0.019607 0.031840 0.017410 0.156550 0.209382
polarizability: 3.23633743e+02 1.01295616e+01 1.54772944e+02 1.30493176e+01 -4.40683603e-01 1.47687047e+02
1716.lowfreq: -7.9545 0.0005 0.0007 0.0009 3.5059 4.8495 19.0904 29.9671 39.6566
frequency: 18.6227 29.9368 39.5427 68.3870 82.4250 94.7166 110.8452 143.7161 156.0730 184.3545 223.9807 232.5837 235.7402 269.0750 296.7075 334.1226 341.7226 372.7116 397.0171 406.8195 433.4359 463.8440 485.1393 497.5848 512.9933 537.1253 573.8869 609.3303 615.9406 640.3316 692.9726 701.6799 714.3910 744.8270 758.4278 766.3011 768.2011 780.8235 823.1051 832.8426 861.6607 896.0552 904.2800 940.8632 955.4979 963.6367 986.7708 989.9392 1010.5166 1016.1483 1022.9055 1057.0067 1081.2984 1090.2370 1113.5425 1122.7135 1146.3640 1175.2933 1186.9464 1195.3979 1214.2887 1249.4205 1281.6714 1309.9229 1311.0631 1329.2149 1383.0464 1421.8964 1422.7142 1429.5235 1450.1843 1464.7398 1465.1063 1470.8737 1504.2791 1589.3389 1594.6865 1595.4213 1617.4687 1624.9306 3001.0060 3100.8948 3131.6141 3138.4190 3142.8858 3144.5737 3147.3527 3157.9126 3169.0054 3170.3434 3174.2942 3608.6353 3612.3673
redmass: 3.9261 5.6724 4.6664 2.8020 2.4439 2.0149 4.6638 5.3998 5.6064 4.7683 5.2325 5.1728 4.9920 7.5531 5.0962 5.6834 5.6329 6.7110 2.7747 4.3002 2.3748 3.8729 2.0503 2.4077 1.8419 4.5048 5.2059 6.6202 7.7309 7.2463 7.0212 2.0195 5.0785 6.1514 1.8056 3.4604 6.1542 3.9513 4.1589 1.5154 1.2480 7.2324 1.5426 1.3664 4.2400 1.3702 6.1315 1.3828 1.3293 5.4832 3.5479 3.6317 1.6551 2.9402 1.2632 1.5410 1.4673 1.0576 1.1273 2.1989 1.4394 1.7994 2.1509 1.4092 1.3168 4.1567 9.4700 2.4303 1.4361 2.1232 1.0501 2.0111 1.0706 3.9557 4.3843 6.1864 6.0182 6.8089 8.3462 8.6723 1.0296 1.1042 1.0855 1.0884 1.1045 1.0890 1.0926 1.0968 1.0954 1.1017 1.0932 1.0784 1.0788
irintensity: 0.0794 0.4845 1.3618 0.2760 1.6912 0.2071 0.8851 4.8923 2.7476 2.7403 5.3679 11.0613 0.1912 12.4815 6.0425 9.1379 11.7000 20.2986 0.0893 6.0859 38.0473 8.7988 24.9721 49.1224 70.5636 229.2147 1.1546 3.0084 17.7444 9.1110 23.5894 43.3560 39.2019 2.4649 73.0170 9.5085 90.1765 25.6348 120.2632 37.8125 0.6828 6.4323 26.1133 1.0889 37.6898 0.7926 1.4280 0.8603 0.1694 91.2508 81.1781 197.1738 1.0204 70.7703 0.1050 98.0190 47.7023 0.1008 11.1489 175.8038 24.9899 54.5085 74.0862 104.1744 1.6774 619.2640 0.5402 57.9362 13.9414 24.5339 12.9587 10.5429 12.1522 60.2511 335.6953 0.6332 11.1220 47.3178 195.8017 96.0468 52.9134 28.6532 0.1897 3.5321 18.2555 7.1069 5.9171 15.5799 5.4862 29.7629 2.8501 85.1227 42.1437
temp: 298.150 k
press: 1.00000 atm
elementType: 15 8 8 8 7 7 6 6 6 6 6 6 6 6 6 6 6 6 6 6 1 1 1 1 1 1 1 1 1 1 1 1 1
symmnumber: 1
zpe: 646811.6 jmol-1
zpe.correction: 0.246358 hartree
zpe.thermalcorrener: 0.264633 hartree
zpe.thermalcorrenthalpy: 0.265577 hartree
zpe.thermalcorrgfe: 0.197960 hartree
zpe.sumelectzpe: -1216.285313 hartree
zpe.sumelectthermal: -1216.267038 hartree
zpe.sumelectthermalent: -1216.266093 hartree
zpe.sumelectthermalfe: -1216.333710 hartree
dipole: -3.3679 3.6645 1.0003
dipole: 5.0766
quadrupole: -117.0515 -121.7014 -120.9245
quadrupole: -3.1219 -17.4390 -11.2273
quadrupole: 2.8410 -1.8089 -1.0320 -3.1219 -17.4390 -11.2273
hfenergy: -1216.5316704 hartree
pointgroup: C01 [X(C14H13N2O3P1)]
dipole: -1.3602395 1.0300083 1.038286 debye
polarizability: 321.5932945|-1.497423|153.1385478|24.9837341|2.6607134|151.3618913 unknown
InChI: InChI=1S/C14H13N2O3P/c1-19-14(17)10-7-8-12-13(9-10)16-20(18,15-12)11-5-3-2-4-6-11/h2-9,15-16H,1H3
charge 0 multiplicity 1
33 atoms
P  -1.795942 -0.430735 -1.302595
O  -2.332041 -0.838393 -2.753051
O  4.613524 1.422897 -0.054423
O  5.33533 -0.516235 1.019926
N  -0.363238 0.595042 -1.156282
N  -0.937543 -1.652577 -0.339188
C  0.750416 -0.036464 -0.555807
C  0.409666 -1.346514 -0.07905
C  -3.160605 0.294199 -0.270708
C  2.048228 0.466503 -0.400461
C  1.378311 -2.150769 0.555456
C  3.022024 -0.344151 0.251468
C  -2.905716 0.770995 1.036503
C  -4.457821 0.354081 -0.830639
C  2.682419 -1.639186 0.721199
C  -3.967931 1.313451 1.792598
C  -5.51489 0.898458 -0.066931
C  -5.270598 1.37638 1.241694
C  4.412612 0.128585 0.458282
C  5.982063 1.958118 0.112192
H  -0.282691 1.495643 -1.624377
H  -1.333471 -2.568619 -0.135935
H  2.329037 1.458772 -0.763023
H  1.123344 -3.153471 0.913842
H  -1.894649 0.72225 1.456247
H  -4.617955 -0.020482 -1.847743
H  3.458745 -2.232673 1.213703
H  -3.781623 1.685497 2.80565
H  -6.523169 0.949807 -0.491322
H  -6.091982 1.797914 1.831743
H  5.950032 2.960374 -0.338506
H  6.712673 1.313212 -0.405004
H  6.246843 2.011392 1.181943
