program: Gaussian 09
title: 000245190
version: EM64L-G09RevD.01
frameworkgroup: C1[X(C22H19NO5)]
method: RPBEPBE
basis: SDD
operation: Freq
keyword: #p
keyword: freq=noraman
keyword: PBEPBE/SDD
title: #p freq=noraman PBEPBE/SDD
converged: YES YES NO NO
title: Mulliken charges:
elementType: O O O O O N C C C C C C C C C C C C C C C C C C C C C C H H H H H H H H H H H H H H H H H H H
charge: -0.280317 -0.275466 -0.245346 -0.191687 -0.155680 0.036692 0.102210 0.354068 0.158200 0.137387 -0.373896 -0.352666 -0.461038 -0.811426 0.501881 0.212675 -0.482301 0.476780 -0.369271 -0.426742 -0.390866 -0.359488 -0.222826 -0.224085 -0.231217 -0.225717 -0.227389 -0.230899 0.243284 0.280117 0.247728 0.204920 0.234593 0.266678 0.233733 0.223964 0.247754 0.268614 0.226593 0.231263 0.271866 0.230336 0.226464 0.229563 0.227787 0.232187 0.230989
chargesum: 0.00000
title: Mulliken charges with hydrogens summed into heavy atoms:
elementType: O O O O O N C C C C C C C C C C C C C C C C C C C C C C
charge: -0.280317 -0.275466 -0.245346 -0.191687 -0.155680 0.036692 0.102210 0.354068 0.158200 0.137387 -0.130612 -0.072549 -0.008390 -0.076422 0.501881 0.212675 -0.010583 0.476780 -0.100657 -0.200148 -0.159604 -0.087622 0.007510 0.002379 -0.001654 0.002070 0.004798 0.000090
polarizability: 3.62213935e+02 -1.16193135e+01 2.78878525e+02 -1.24702124e+00 -1.39390511e-01 1.65283190e+02
1716.lowfreq: -6.4261 -3.0702 -0.0006 -0.0002 0.0005 2.8226 17.1702 19.9070 21.8634
frequency: 16.1139 19.7658 21.7847 29.7350 34.4957 40.1000 52.9895 74.0608 89.5200 100.6478 117.2908 119.0562 124.6841 130.7539 157.5873 172.6555 205.4817 228.8038 249.4269 259.2927 294.4417 302.5201 314.3579 332.4650 344.4031 390.5604 396.6961 404.0509 404.2355 419.0444 475.3903 484.6275 514.6975 538.0934 555.1859 584.9319 595.6065 615.8704 617.4283 619.0296 635.2802 666.8048 703.4501 704.1688 713.1513 729.5690 745.2306 753.9812 760.7232 771.1392 813.4030 817.2131 837.1014 850.1930 855.4925 858.4390 861.1077 888.5258 930.7876 933.2922 941.5339 968.1132 976.9425 978.4030 982.3167 984.9045 990.2460 990.6891 1001.3533 1003.7523 1008.5413 1026.6653 1027.7220 1046.9970 1089.8033 1092.0867 1112.7023 1146.9808 1171.2901 1173.3745 1174.4084 1188.5544 1190.4793 1191.1760 1222.7891 1230.0376 1234.0137 1244.8780 1253.8391 1260.6152 1329.1496 1331.0993 1343.3084 1348.7513 1369.7746 1386.2472 1386.4896 1391.5735 1396.3221 1400.5945 1442.0977 1443.4420 1460.1840 1461.6438 1472.8187 1476.8746 1482.5002 1485.8762 1486.7206 1562.8227 1594.7311 1595.5812 1604.3051 1614.8561 1616.3670 1616.7122 2979.5101 2990.1252 3039.6176 3058.2252 3063.6159 3102.0052 3114.5406 3117.1522 3119.7653 3127.4241 3130.5784 3137.8594 3140.5679 3142.4425 3149.9966 3153.3174 3164.8377 3167.1308 3187.6684
redmass: 5.9519 5.1359 6.1186 4.4487 4.9908 5.5169 6.0256 5.6340 5.2876 4.4011 5.5450 1.0483 8.1391 5.9874 5.2714 7.8083 6.5958 5.8788 6.7533 5.6687 3.7135 4.8623 6.7743 2.6279 3.1399 3.8479 3.9896 2.8156 2.8232 5.6991 4.0176 4.0017 5.4766 6.4578 4.8666 5.0183 4.8602 6.2642 6.3749 6.0285 6.2113 7.1225 2.0555 1.8479 4.8999 4.8489 4.5802 3.1405 2.3717 3.6827 5.6587 3.5095 2.7749 1.6440 2.5439 1.3311 1.6587 6.1141 1.5965 1.8583 2.4004 1.6446 1.5554 1.5613 1.3850 1.4170 5.4698 6.1825 1.3279 1.3383 1.7117 2.1930 2.2137 1.5507 1.5293 1.5216 4.2969 4.0728 1.5499 1.0727 1.0549 1.1001 1.1191 1.1270 2.8287 2.5913 1.2211 7.2951 3.1091 2.3443 1.2726 1.2600 1.5294 1.3073 7.7284 7.0353 7.9900 2.3084 3.7694 1.9908 2.1867 2.1911 1.1451 1.1192 1.1219 2.9114 1.1266 2.3166 2.3010 6.3886 6.1096 6.0915 7.6189 6.8548 6.1761 8.5267 1.0406 1.0570 1.0585 1.1073 1.0930 1.1005 1.1067 1.0873 1.0882 1.0869 1.0873 1.0919 1.0905 1.0918 1.0965 1.0964 1.1016 1.1015 1.0943
irintensity: 0.1682 1.0591 1.2553 0.2569 0.0211 1.0617 0.5753 1.4455 1.5486 0.4187 1.3044 0.5252 0.4421 1.0767 0.2897 2.8151 1.1676 1.3329 5.1085 2.1236 5.2486 3.0822 3.6898 1.3573 6.0041 8.1081 6.5013 0.5031 0.1597 9.0174 6.8453 14.6878 7.7830 12.8454 1.0165 2.6375 18.8639 0.5692 0.1618 1.0195 12.2856 11.4614 33.5685 55.9933 30.7857 34.9371 32.7697 68.0878 49.3572 2.9661 27.3288 6.9753 8.0988 26.1783 9.8733 0.7808 8.8107 79.4678 56.0675 134.1300 167.5976 4.0785 24.5893 8.2752 0.4118 3.1350 0.1431 0.2517 0.1992 0.6437 71.8655 3.8838 4.0731 14.0524 5.9137 4.9732 150.2323 56.3523 3.6836 0.2902 0.0608 6.6391 4.3009 2.4052 43.2109 53.7421 55.1642 301.6893 242.4267 1.6151 4.0610 1.7920 47.4634 18.6659 11.9045 3.4913 2.5801 29.6458 165.6220 61.5726 9.5136 9.6361 8.7415 31.5391 17.5585 0.4481 11.2427 8.7834 4.6666 27.2387 3.5504 1.0048 30.6697 32.4686 5.6270 86.9088 12.5743 41.8125 34.1053 13.6110 14.3588 8.7068 3.2399 7.4339 7.8198 1.2645 2.4794 13.2125 12.7224 16.9845 28.1955 24.1577 28.3850 21.3936 1.4148
temp: 298.150 k
press: 1.00000 atm
elementType: 8 8 8 8 8 7 6 6 6 6 6 6 6 6 6 6 6 6 6 6 6 6 6 6 6 6 6 6 1 1 1 1 1 1 1 1 1 1 1 1 1 1 1 1 1 1 1
symmnumber: 1
zpe: 941277.8 jmol-1
zpe.correction: 0.358514 hartree
zpe.thermalcorrener: 0.383838 hartree
zpe.thermalcorrenthalpy: 0.384782 hartree
zpe.thermalcorrgfe: 0.298773 hartree
zpe.sumelectzpe: -1278.533391 hartree
zpe.sumelectthermal: -1278.508067 hartree
zpe.sumelectthermalent: -1278.507123 hartree
zpe.sumelectthermalfe: -1278.593132 hartree
dipole: -0.2658 5.3104 -0.3454
dipole: 5.3282
quadrupole: -127.7992 -143.8340 -165.5821
quadrupole: 1.4576 0.0339 3.0196
quadrupole: 17.9392 1.9045 -19.8437 1.4576 0.0339 3.0196
hfenergy: -1278.8919053 hartree
pointgroup: C01 [X(C22H19N1O5)]
dipole: -0.0562948 -0.5921933 -2.010116 debye
polarizability: 361.2067952|-5.2648823|171.0200979|15.2600672|24.1549611|274.1487577 unknown
InChI: InChI=1S/C22H19NO5/c1-16-12-13-19(22(24)28-15-18-10-6-3-7-11-18)20(23(25)26)21(16)27-14-17-8-4-2-5-9-17/h2-13H,14-15H2,1H3
charge 0 multiplicity 1
47 atoms
O  2.610747 -0.682189 -0.5609
O  -3.21704 0.842388 -1.569993
O  -1.970468 1.742842 0.189729
O  1.278273 1.659601 0.802826
O  -0.02363 -0.03967 1.592216
N  0.518498 0.629945 0.64562
C  1.446006 -0.512174 -1.33101
C  1.337739 -1.082937 -2.630751
C  0.330645 0.136911 -0.749439
C  -0.904466 0.264289 -1.431901
C  0.097274 -0.968676 -3.305856
C  -1.000396 -0.304209 -2.726857
C  3.699505 0.345485 -0.804159
C  2.513054 -1.814872 -3.242252
C  4.75076 0.160384 0.259111
C  -2.046793 1.018634 -0.832772
C  -4.446904 1.549648 -1.041614
C  -5.236045 0.654838 -0.113496
C  4.515396 0.628305 1.578104
C  5.978436 -0.479474 -0.041621
C  -6.321986 -0.110854 -0.608683
C  -4.900331 0.573362 1.263488
C  5.495029 0.45376 2.578928
C  6.962202 -0.650323 0.958664
C  6.720827 -0.184051 2.271392
C  -7.061824 -0.948583 0.255273
C  -5.637451 -0.266419 2.126388
C  -6.71977 -1.027926 1.62536
H  -0.00599 -1.413509 -4.301766
H  -1.948813 -0.215586 -3.261413
H  3.223598 1.341186 -0.745747
H  4.111663 0.182023 -1.818355
H  3.161547 -1.124212 -3.815991
H  3.133284 -2.277915 -2.456492
H  2.17109 -2.598435 -3.939262
H  -5.003524 1.786892 -1.96145
H  -4.107882 2.471336 -0.538864
H  3.564473 1.121156 1.811884
H  6.163418 -0.846215 -1.059151
H  -6.586837 -0.051422 -1.6718
H  -4.057181 1.159503 1.645795
H  5.306041 0.815739 3.595543
H  7.909997 -1.144284 0.717334
H  7.48185 -0.315317 3.049042
H  -7.900707 -1.534948 -0.135836
H  -5.369479 -0.326173 3.186874
H  -7.292435 -1.677255 2.297159
