program: Gaussian 09
title: 000245189
version: EM64L-G09RevD.01
frameworkgroup: C1[X(C20H22N2O7)]
method: RPBEPBE
basis: SDD
operation: Freq
keyword: #p
keyword: freq=noraman
keyword: PBEPBE/SDD
title: #p freq=noraman PBEPBE/SDD
converged: YES YES NO NO
title: Mulliken charges:
elementType: O O O O O O O N N C C C C C C C C C C C C C C C C C C C C H H H H H H H H H H H H H H H H H H H H H H
charge: -0.427849 -0.279907 -0.255593 -0.241931 -0.245819 -0.187458 -0.174730 -0.426966 0.039663 -0.189058 -0.071819 0.222791 0.147489 0.121942 0.086304 -0.704358 0.350880 0.243629 -0.402891 -0.390736 -0.811902 -0.451412 0.497914 -0.368478 -0.433708 -0.496481 -0.223405 -0.223527 -0.231422 0.291307 0.252464 0.349347 0.217552 0.239751 0.241631 0.255136 0.243934 0.266649 0.232023 0.234094 0.202632 0.248722 0.331139 0.274538 0.226415 0.250056 0.247509 0.238155 0.229879 0.226431 0.229475
chargesum: 0.00000
title: Mulliken charges with hydrogens summed into heavy atoms:
elementType: O O O O O O O N N C C C C C C C C C C C C C C C C C C C C
charge: -0.096710 -0.279907 -0.255593 -0.241931 -0.245819 -0.187458 -0.174730 -0.077619 0.039663 0.102249 0.180644 0.222791 0.147489 0.121942 0.086304 -0.005424 0.350880 0.243629 -0.147755 -0.146802 -0.079136 -0.000059 0.497914 -0.093940 -0.207293 0.239239 0.006474 0.002904 -0.001947
polarizability: 3.64593633e+02 3.14099892e+00 2.60377956e+02 -1.01556410e+01 -1.63204041e+01 1.72384534e+02
1716.lowfreq: -2.3230 -0.0008 0.0006 0.0008 2.6553 4.9094 13.1248 21.4729 25.3650
frequency: 13.0352 21.4186 25.3498 34.8964 40.0824 49.4426 54.6563 60.2820 77.6298 82.3530 97.1726 104.5007 110.0858 115.4785 121.4386 135.8363 139.8979 151.1845 175.4501 188.0638 197.1215 225.4884 241.3972 247.5845 252.3965 279.4744 295.8229 299.2901 304.7134 317.5225 326.3231 339.5438 359.6036 383.3258 404.3013 416.3202 428.0026 448.1723 470.4133 506.5905 534.2449 562.4018 586.9044 602.9370 616.6510 620.2340 641.6365 658.7150 673.4294 700.3466 705.3509 718.7973 724.7692 739.6389 750.8457 775.5422 783.5251 820.7908 829.8286 834.4710 847.8146 858.3076 881.4561 892.4715 908.8622 930.1598 960.1124 961.2291 969.2656 977.4826 982.4904 990.7583 998.8542 1001.8364 1014.7442 1027.1031 1049.1129 1059.1413 1086.6776 1089.2830 1115.9720 1125.4692 1146.8353 1153.4722 1164.2056 1173.0769 1177.8214 1188.5223 1190.0827 1193.5237 1230.0101 1234.3019 1242.3021 1253.1304 1257.1094 1289.9376 1303.2163 1328.1174 1331.6782 1340.3887 1363.5911 1372.3623 1383.0303 1386.9204 1392.2292 1395.1273 1401.0753 1425.4835 1442.1325 1455.3646 1456.6021 1460.6680 1462.6103 1464.8885 1472.6411 1473.2598 1482.2488 1483.4765 1487.1477 1560.9879 1595.6328 1597.2062 1603.4490 1616.7791 1636.4143 2981.1207 2990.4706 2995.4298 3011.3489 3020.4671 3064.5144 3065.7569 3067.4194 3090.8263 3101.2086 3103.8079 3116.6137 3117.3716 3128.1915 3134.0858 3139.9720 3151.1194 3158.4019 3159.0524 3165.2071 3460.7567 3540.0410
redmass: 6.0393 4.9161 6.2462 4.7829 5.4664 4.7031 4.6478 5.7411 5.8552 5.5498 2.4845 1.8254 4.1888 2.7467 4.3267 1.4777 2.2613 8.3823 4.4566 5.8922 5.1367 4.2130 4.4519 3.7361 1.4050 3.8972 2.6904 4.0829 3.9513 1.9311 2.6484 2.6357 6.2759 5.3863 2.8161 5.8079 3.5457 5.0742 4.0161 3.9300 6.6587 5.3164 4.4016 5.4603 6.2363 5.7072 6.6899 3.8300 2.7010 2.1398 1.7923 5.9828 5.0002 4.0336 3.4730 3.4582 5.2343 5.0637 4.6152 1.8119 2.5356 1.2698 6.6858 5.4953 2.4409 1.4491 2.4940 1.7579 1.6735 3.1738 1.3871 6.1562 1.6502 1.3289 1.8522 2.1895 1.5425 1.8263 2.4271 1.5258 1.2658 3.0751 3.5329 1.4225 2.0530 1.0559 2.3051 1.0934 1.1663 2.2227 2.5478 1.4879 11.0137 2.4633 1.9524 2.0719 1.4039 1.2832 1.5024 1.6484 7.0795 1.1751 3.6735 8.3021 2.9902 1.2398 1.4566 1.2007 2.1856 1.0492 1.2769 1.2165 1.0523 1.3753 1.0561 1.1169 2.1690 1.3211 2.3032 5.9505 6.1021 8.4224 7.7386 6.0942 8.4202 1.0399 1.0367 1.0581 1.0294 1.0827 1.0940 1.0888 1.1056 1.0956 1.1006 1.1007 1.0873 1.1052 1.0869 1.0883 1.0917 1.0965 1.1053 1.0961 1.1016 1.0770 1.0655
irintensity: 0.4386 0.2423 1.1362 1.1114 1.2160 1.0128 2.8680 0.8401 2.4874 1.4169 0.3263 2.0486 2.4698 0.7898 1.3837 3.1065 1.9957 4.0211 1.6945 2.4749 0.9662 15.1473 4.1319 11.3520 5.7255 8.4530 43.7976 9.3446 2.6813 71.7136 32.0657 4.7712 12.1971 5.2158 0.7085 3.4676 24.8845 41.2392 9.2072 14.4080 8.0630 2.9084 0.8667 7.9546 2.6690 11.9041 10.3757 28.6838 4.3676 37.6043 40.6745 10.8109 16.3213 37.7457 62.6740 7.4469 41.8582 64.0728 14.2030 18.6628 19.1021 0.2891 116.9489 19.2986 15.8977 1.0870 13.3635 5.2708 0.2857 18.3957 0.3793 0.2356 32.0606 0.1932 17.0451 5.1711 8.2483 126.2498 2.2957 7.7825 0.4210 111.8097 30.4749 1.2672 60.7402 0.1638 103.9750 6.2539 5.3655 20.8973 24.8362 40.2405 150.9720 39.0866 54.0515 249.6017 67.7816 12.1118 100.2978 21.8253 12.1813 26.6809 64.6427 48.6577 91.5282 33.9712 9.1448 29.2059 12.1290 15.6784 109.6150 81.7735 22.7772 207.8660 13.2182 19.1863 76.9835 11.4888 3.9226 46.3404 1.0873 152.8864 7.3691 0.1906 111.8234 15.1958 13.5312 44.9417 32.2963 9.5162 19.6884 1.5613 6.0909 47.4134 9.3056 18.6078 7.8479 19.7066 1.7663 8.8804 17.3325 24.5755 13.5471 11.5486 27.6185 101.0875 2.1752
temp: 298.150 k
press: 1.00000 atm
elementType: 8 8 8 8 8 8 8 7 7 6 6 6 6 6 6 6 6 6 6 6 6 6 6 6 6 6 6 6 6 1 1 1 1 1 1 1 1 1 1 1 1 1 1 1 1 1 1 1 1 1 1
symmnumber: 1
zpe: 1028690.2 jmol-1
zpe.correction: 0.391807 hartree
zpe.thermalcorrener: 0.421238 hartree
zpe.thermalcorrenthalpy: 0.422183 hartree
zpe.thermalcorrgfe: 0.327917 hartree
zpe.sumelectzpe: -1409.171995 hartree
zpe.sumelectthermal: -1409.142564 hartree
zpe.sumelectthermalent: -1409.141620 hartree
zpe.sumelectthermalfe: -1409.235885 hartree
dipole: 0.0654 4.3752 -1.2933
dipole: 4.5628
quadrupole: -141.4190 -150.0217 -177.0359
quadrupole: 16.2089 1.3803 3.0008
quadrupole: 14.7399 6.1371 -20.8770 16.2089 1.3803 3.0008
hfenergy: -1409.5638023 hartree
pointgroup: C01 [X(C20H22N2O7)]
dipole: -0.0406766 1.5755673 0.8593345 debye
polarizability: 364.9826087|-5.8867926|249.8620638|1.7423892|32.9482619|182.5114499 unknown
InChI: InChI=1S/C20H22N2O7/c1-12-9-10-15(19(24)21-16(13(2)23)20(25)28-3)17(22(26)27)18(12)29-11-14-7-5-4-6-8-14/h4-10,13,16,21,23H,11H2,1-3H3
charge 0 multiplicity 1
51 atoms
O  6.038581 1.343843 0.209485
O  -2.834632 0.514946 0.467495
O  5.968141 -2.044154 0.743304
O  2.023638 -0.138941 -1.698459
O  4.563853 -0.972994 2.263276
O  -1.479567 -0.986883 -1.576469
O  0.054923 -1.846295 -0.124922
N  3.19441 0.269142 0.280898
N  -0.627396 -0.873753 -0.617592
C  4.38321 -0.480306 -0.150243
C  5.488756 0.420161 -0.799133
C  0.86734 0.993904 0.121498
C  2.05673 0.313129 -0.514836
C  -0.44026 0.468492 -0.011531
C  -1.581467 1.145044 0.490262
C  4.995684 1.165967 -2.045157
C  -1.420048 2.39641 1.155809
C  4.952861 -1.176022 1.088808
C  1.012204 2.241409 0.769745
C  -0.113305 2.922883 1.281444
C  -2.621996 3.109485 1.739232
C  -3.756072 0.906879 -0.670025
C  -4.951455 -0.009322 -0.622416
C  -4.823498 -1.362714 -1.030258
C  -6.20892 0.464779 -0.174269
C  6.651027 -2.727809 1.872749
C  -5.939006 -2.225844 -0.985101
C  -7.328188 -0.397554 -0.134459
C  -7.193798 -1.745389 -0.539081
H  4.078295 -1.234505 -0.900779
H  6.340408 -0.236218 -1.043578
H  3.101749 0.387838 1.298147
H  4.160346 1.846795 -1.797656
H  5.822783 1.763504 -2.465451
H  4.627077 0.464622 -2.813139
H  2.007422 2.689223 0.854205
H  0.024002 3.882856 1.791718
H  -3.373373 2.380838 2.087557
H  -2.327671 3.753493 2.584867
H  -3.110951 3.757217 0.985865
H  -4.049348 1.965236 -0.532844
H  -3.179792 0.789256 -1.60454
H  5.342027 2.017815 0.421851
H  -3.849401 -1.729167 -1.373191
H  -6.312117 1.509472 0.145334
H  7.109118 -1.979271 2.539708
H  5.925762 -3.334109 2.439959
H  7.413072 -3.358817 1.396046
H  -5.833256 -3.270028 -1.299504
H  -8.297936 -0.022201 0.21093
H  -8.059669 -2.41654 -0.50836
