program: Gaussian 09
title: 000245208
version: EM64L-G09RevD.01
frameworkgroup: C1[X(C20H17N5O6)]
method: RPBEPBE
basis: SDD
operation: Freq
keyword: #p
keyword: freq=noraman
keyword: PBEPBE/SDD
title: #p freq=noraman PBEPBE/SDD
converged: YES YES NO NO
title: Mulliken charges:
elementType: O O O O O O N N N N N C C C C C C C C C C C C C C C C C C C C H H H H H H H H H H H H H H H H H
charge: -0.184415 -0.171440 -0.257201 -0.174462 -0.197135 -0.200500 -0.262922 -0.398822 0.014028 -0.004563 0.013217 0.217911 0.375714 0.373801 0.300839 0.400064 -0.368702 -0.344930 -0.315492 -0.369340 -0.567348 -0.542389 0.495959 0.455170 0.441566 -0.416774 -0.357605 -0.368688 -0.402743 -0.806111 -0.803675 0.369247 0.263638 0.281337 0.263596 0.243202 0.340984 0.321410 0.234808 0.239722 0.236046 0.238923 0.236512 0.225724 0.232843 0.239522 0.227324 0.232150
chargesum: 0.00000
title: Mulliken charges with hydrogens summed into heavy atoms:
elementType: O O O O O O N N N N N C C C C C C C C C C C C C C C C C C C C
charge: -0.184415 -0.171440 -0.257201 -0.174462 -0.197135 -0.200500 -0.262922 -0.029575 0.014028 -0.004563 0.013217 0.217911 0.375714 0.373801 0.300839 0.400064 -0.105064 -0.063593 -0.051896 -0.126137 -0.226363 -0.220980 0.495959 0.455170 0.441566 -0.181966 -0.117883 -0.132642 -0.163820 -0.111031 -0.104679
polarizability: 5.25324397e+02 1.27730013e+00 3.02032030e+02 -1.16414056e+01 -1.90322255e+01 2.63467892e+02
1716.lowfreq: -6.3804 -0.0006 -0.0005 -0.0002 1.5920 3.9553 16.5785 21.0543 29.9244
frequency: 16.4928 20.9232 29.9169 34.3211 38.6849 40.6635 51.3436 59.5626 66.5743 76.1648 86.1137 87.5603 107.5869 123.1977 143.0591 149.4151 175.7489 178.9166 190.6069 200.9150 250.1304 262.6165 286.7722 307.3899 319.8205 323.2504 341.2357 353.0709 362.9964 375.9094 395.8168 408.4359 409.5734 413.0613 434.5743 481.7466 505.8036 512.7017 517.5140 541.2046 548.4728 571.9752 606.7385 631.3053 634.1151 639.9672 665.9426 671.9046 679.3728 699.0882 704.5749 710.8910 722.5339 733.2821 736.5744 774.1470 781.5765 799.4348 809.3757 819.7058 826.1222 832.3469 846.8574 882.6257 898.6953 915.0432 946.6992 947.8349 951.5691 967.7834 970.9520 980.2870 988.9800 989.1046 1006.7034 1008.7874 1047.0266 1048.3516 1068.9202 1094.3539 1124.5578 1128.8125 1134.9014 1165.9062 1170.8592 1191.8737 1194.3196 1204.1670 1223.9757 1225.6564 1227.6377 1234.4185 1278.0777 1296.4430 1311.5987 1315.3354 1334.0202 1353.4577 1365.8189 1373.7695 1375.6452 1380.5488 1400.1108 1400.8854 1412.3717 1420.2726 1439.5206 1469.9277 1470.3232 1473.5594 1475.1208 1476.1070 1492.8901 1498.1463 1501.3022 1574.4822 1576.3797 1585.3057 1610.9243 1616.2962 1622.0251 2977.8364 2979.5595 3055.6412 3058.1171 3086.4407 3088.4870 3127.4860 3129.8097 3131.2558 3132.2460 3149.6966 3165.7041 3168.3638 3176.8413 3182.8897 3186.5471 3250.0291
redmass: 8.2025 6.3729 2.4198 1.4498 4.4062 1.0875 3.9116 13.3223 7.2922 4.9766 7.0028 8.0484 9.1117 6.2170 4.7050 9.6262 8.4850 6.1622 6.3593 6.6704 4.3561 6.1036 4.7989 11.0763 8.8584 4.9108 3.4794 4.0495 7.0653 4.9071 7.2508 2.9713 6.5973 3.0239 5.2082 3.7489 4.4383 3.4872 7.4940 5.0440 4.4108 5.2651 6.8847 7.0093 6.8146 7.6502 8.6035 10.6379 7.4187 5.9407 3.9806 3.2714 3.1342 5.9583 11.3464 2.6811 2.0846 4.9283 4.1439 1.5008 1.5473 1.2886 1.2711 7.3833 9.2363 6.2404 1.4542 1.3246 1.3094 1.3635 1.4136 1.3420 1.4152 1.4321 2.9259 2.7151 1.5479 1.5515 1.9543 2.9468 5.8545 1.3654 1.3334 6.0636 1.9582 1.1465 1.2023 9.5852 2.4990 5.0033 2.7873 6.1400 3.9152 2.1511 1.4305 1.3424 4.9700 5.3050 5.7353 12.3472 5.8033 7.3154 1.2486 1.2540 3.2316 3.2914 7.5100 1.0459 1.0489 2.5551 1.1310 1.1425 3.7071 2.6159 2.5884 6.0487 5.9895 6.5043 8.2142 6.2682 6.5327 1.0374 1.0376 1.0974 1.0973 1.0988 1.0990 1.0877 1.0898 1.0896 1.0899 1.0965 1.0954 1.0946 1.0941 1.0929 1.0923 1.0806
irintensity: 0.0483 0.2584 0.4434 0.6268 0.7593 0.4643 0.2439 0.0868 0.4324 0.3122 1.9171 0.7578 4.9361 2.6180 1.3160 1.6774 1.2277 1.5548 2.1103 2.2745 0.3408 2.0507 0.7168 0.1092 1.0806 0.4178 0.6209 0.6028 1.8121 1.0912 2.5125 1.6328 4.7645 0.4891 17.5310 3.8780 4.3384 12.2453 12.4883 10.1859 20.8473 9.3234 11.4091 5.1778 1.3222 19.7075 7.5924 8.8292 0.5917 13.7885 24.3361 2.4751 48.5965 28.3273 3.0747 30.4295 96.4146 12.4182 1.0257 73.8957 4.5715 17.1492 1.1558 3.8342 17.3692 1.4972 10.2488 2.9208 0.1341 0.2768 22.4542 0.1950 5.3243 2.5670 7.9565 8.0956 10.3400 8.4428 47.1523 1.3868 115.3734 2.5433 6.6253 333.1107 43.7608 3.2932 18.5328 475.6126 8.7738 105.3017 8.9614 182.0231 68.5323 111.6702 10.4359 7.9728 82.0588 145.7334 22.4909 83.9216 5.7158 67.1827 5.8061 11.3553 1.1812 0.1926 1.6265 13.3092 13.3783 31.1164 15.5210 6.9777 1.2231 177.0252 42.6950 57.2097 10.8185 9.1385 82.3523 9.1281 35.8233 48.3481 34.3226 17.6026 16.2513 19.9313 15.7457 10.3180 10.3528 25.3312 33.5807 7.9534 4.0572 5.2827 0.5278 19.1595 28.9073 96.7442
temp: 298.150 k
press: 1.00000 atm
elementType: 8 8 8 8 8 8 7 7 7 7 7 6 6 6 6 6 6 6 6 6 6 6 6 6 6 6 6 6 6 6 6 1 1 1 1 1 1 1 1 1 1 1 1 1 1 1 1 1
symmnumber: 1
zpe: 909258.3 jmol-1
zpe.correction: 0.346318 hartree
zpe.thermalcorrener: 0.374426 hartree
zpe.thermalcorrenthalpy: 0.375370 hartree
zpe.thermalcorrgfe: 0.283796 hartree
zpe.sumelectzpe: -1494.957277 hartree
zpe.sumelectthermal: -1494.929169 hartree
zpe.sumelectthermalent: -1494.928225 hartree
zpe.sumelectthermalfe: -1495.019799 hartree
dipole: 6.7453 2.5627 0.8053
dipole: 7.2605
quadrupole: -195.7240 -159.1882 -199.9971
quadrupole: -5.5948 -2.9465 8.8658
quadrupole: -10.7543 25.7816 -15.0273 -5.5948 -2.9465 8.8658
hfenergy: -1495.3035948 hartree
pointgroup: C01 [X(C20H17N5O6)]
dipole: -2.4481795 -1.4268181 -0.3607314 debye
polarizability: 515.2552063|27.6177579|289.7053031|37.9315971|32.1314273|285.8638096 unknown
InChI: InChI=1S/C20H17N5O6/c1-13-3-7-15(8-4-13)22(16-9-5-14(2)6-10-16)21-20-18(24(28)29)11-17(23(26)27)12-19(20)25(30)31/h3-12,21H,1-2H3
charge 0 multiplicity 1
48 atoms
O  2.428909 0.984721 4.09872
O  0.48061 0.293053 -2.685926
O  0.219381 0.827568 3.54631
O  -0.544276 2.066222 -1.65928
O  5.813207 1.844936 0.801326
O  5.300981 1.751897 -1.426587
N  -1.232087 -0.232497 0.128071
N  -0.44632 0.464001 1.063166
N  1.487912 0.960444 3.219948
N  0.321675 1.108355 -1.702033
N  4.981026 1.693148 -0.174709
C  0.833526 0.871914 0.770059
C  -2.590017 0.222593 0.00638
C  -0.812068 -1.581153 -0.197691
C  1.827651 1.075307 1.802927
C  1.297306 1.050694 -0.578732
C  -3.647329 -0.687916 -0.250576
C  -1.055326 -2.086246 -1.49976
C  -2.882014 1.604345 0.164478
C  -0.143356 -2.38667 0.754463
C  3.175681 1.349855 1.494235
C  2.627833 1.296266 -0.898937
C  3.567834 1.432372 0.15416
C  -5.282026 1.163736 -0.20391
C  0.027504 -4.218734 -0.890435
C  -4.969105 -0.211404 -0.358476
C  -0.648248 -3.392681 -1.828538
C  -4.210958 2.055399 0.065685
C  0.273987 -3.688066 0.400845
C  -6.708256 1.668465 -0.322736
C  0.48303 -5.615824 -1.269786
H  -0.718982 0.495192 2.065567
H  -3.443494 -1.757483 -0.350734
H  -1.544451 -1.454827 -2.247286
H  -2.070997 2.313061 0.349501
H  0.042325 -2.01079 1.76662
H  3.902813 1.476173 2.300801
H  2.949964 1.414068 -1.937224
H  -5.776108 -0.9273 -0.553703
H  -0.839905 -3.769861 -2.839959
H  -4.418435 3.125056 0.188306
H  0.789746 -4.304062 1.146589
H  -6.816218 2.368765 -1.172607
H  -7.419311 0.839626 -0.479589
H  -7.020657 2.213992 0.587247
H  1.267996 -5.581688 -2.048945
H  0.896604 -6.157402 -0.402269
H  -0.351457 -6.215525 -1.677775
