program: Gaussian 09
title: 000245129
version: EM64L-G09RevD.01
frameworkgroup: C1[X(C13H7FO)]
method: RPBEPBE
basis: SDD
operation: Freq
keyword: #p
keyword: freq=noraman
keyword: PBEPBE/SDD
title: #p freq=noraman PBEPBE/SDD
converged: NO YES NO YES
title: Mulliken charges:
elementType: F O C C C C C C C C C C C C C H H H H H H H
charge: -0.169747 -0.137354 0.336217 0.266163 -0.004796 0.209205 -0.229186 -0.429937 -0.383911 0.211070 -0.411848 -0.176124 -0.382447 -0.218396 -0.228420 0.251751 0.246134 0.281451 0.236865 0.262059 0.233148 0.238103
chargesum: 0.00000
title: Mulliken charges with hydrogens summed into heavy atoms:
elementType: F O C C C C C C C C C C C C C
charge: -0.169747 -0.137354 0.336217 0.266163 -0.004796 0.209205 -0.229186 -0.178185 -0.137778 0.211070 -0.130397 0.060741 -0.120387 0.014752 0.009683
polarizability: 2.23553910e+02 -8.36715025e+00 1.60596241e+02 -6.16937523e-03 -2.40850432e-03 5.29203383e+01
1716.lowfreq: -4.1871 -0.0010 -0.0009 -0.0008 3.8852 9.1601 79.5844 111.6377 145.7016
frequency: 79.5816 111.6365 145.7011 171.8346 231.5822 252.9437 274.6015 329.5731 415.6439 426.9085 440.7577 491.7754 514.7176 531.9221 575.6320 605.7997 642.7900 667.4568 670.4131 742.0321 757.3973 772.4541 810.4890 836.6370 860.1615 895.4368 906.6284 910.5490 969.3992 977.7051 999.3142 1015.1325 1042.7726 1070.5147 1103.9419 1143.7185 1167.8607 1180.7250 1189.0044 1217.8500 1266.5866 1293.8833 1372.4691 1396.3029 1435.3931 1449.2156 1459.9701 1478.5852 1592.3801 1600.9948 1603.7251 1618.8341 1639.3875 3130.7048 3141.6155 3143.4744 3153.9599 3159.8768 3168.8713 3179.9153
redmass: 8.5837 4.3985 6.1347 6.8233 4.5984 9.2456 5.4959 8.6493 3.3277 8.1388 4.1613 6.5062 3.6751 7.4342 8.1281 4.1062 6.8668 6.8966 3.8849 1.7115 6.7093 1.4711 2.0673 3.9351 6.9087 1.3579 1.6489 7.3221 1.4428 1.3586 1.3567 2.2393 2.7642 2.4855 2.1944 2.7912 1.1852 1.2094 2.3430 2.5810 2.1704 1.8358 8.9425 2.8095 2.4054 2.9673 3.0245 4.7181 8.2664 7.7207 6.9523 8.2754 10.8616 1.0864 1.0882 1.0895 1.0947 1.0936 1.1003 1.0977
irintensity: 1.2945 1.8265 0.0488 0.7341 0.1072 0.9683 0.0022 2.4949 0.3773 0.4063 4.5766 2.2201 0.0627 1.2618 2.2276 3.6366 0.3994 10.3360 13.7204 2.6172 1.2102 136.0423 29.7051 0.0002 52.3718 0.0084 0.1594 13.2801 3.0964 1.9192 0.0081 0.3918 3.9107 4.2766 36.4244 24.2740 5.2572 3.8627 35.0372 42.3532 16.7511 10.1640 2.4243 1.6900 42.8523 8.5647 35.6334 3.2268 60.6840 153.7659 4.1796 122.6086 115.7751 2.1303 7.3157 2.2290 10.8566 14.4099 28.2964 6.3417
temp: 298.150 k
press: 1.00000 atm
elementType: 9 8 6 6 6 6 6 6 6 6 6 6 6 6 6 1 1 1 1 1 1 1
symmnumber: 1
zpe: 415326.3 jmol-1
zpe.correction: 0.158189 hartree
zpe.thermalcorrener: 0.168863 hartree
zpe.thermalcorrenthalpy: 0.169807 hartree
zpe.thermalcorrgfe: 0.121619 hartree
zpe.sumelectzpe: -673.656789 hartree
zpe.sumelectthermal: -673.646115 hartree
zpe.sumelectthermalent: -673.645171 hartree
zpe.sumelectthermalfe: -673.693359 hartree
dipole: -1.7222 -5.3579 0.0001
dipole: 5.6279
quadrupole: -68.8216 -85.6935 -88.5130
quadrupole: -7.5663 -0.0004 -0.0003
quadrupole: 12.1878 -4.6841 -7.5036 -7.5663 -0.0004 -0.0003
hfenergy: -673.8149781 hartree
pointgroup: C01 [X(C13H7F1O1)]
dipole: 0.6496608 2.1167361 0.0000473 debye
dipolederiv: -0.5321024 -0.3093114 -0.0000309 -0.5860813 -0.6914169 -0.0000517 -0.0000536 -0.0000509 -0.1308105 -0.482865 -0.0489893 -0.0000118 -0.0341988 -1.0236018 -0.0000387 -0.0000041 0.000028 -0.2923736 0.3349412 -0.1315129 0.0000071 -0.1346315 0.1969578 -0.0000031 0.0000309 -0.0000084 0.0173164 0.2106642 0.086368 0.0000079 0.0120667 0.0324141 0.0000014 -0.000012 -0.0000044 -0.0100076 -0.8424242 0.181052 -0.000029 0.2193925 -0.417741 0.0000038 -0.0000145 -0.0000162 -0.0150557 -0.6420903 -0.1916723 -0.0000267 -0.0743089 -0.2129161 -0.0000025 -0.0000425 -0.0000124 0.0299239 1.3247778 0.0068062 0.0000465 -0.1017458 1.2515666 0.0000293 0.0000432 0.0000048 0.1459297 -0.4092053 0.2289468 0.0000026 0.2065159 -0.0311003 0.000016 -0.0000029 0.0000228 -0.1706566 -0.3155489 -0.1025091 -0.0000129 -0.0123937 0.1062386 0.0000118 -0.0000056 0.0000164 -0.1434756 0.8245228 0.2375124 0.0000425 0.7024096 0.8923875 0.0000698 0.0000714 0.000057 0.1431226 0.0753448 0.043461 0.0000082 -0.146166 0.1510959 0.0000029 0.0000055 0.0000049 -0.1139889 0.2700277 -0.1134112 0.0000106 0.0039883 0.1166849 0.0000088 0.0000124 0.0000031 -0.1123953 -0.0828034 0.0647761 0.0000089 -0.1247591 -0.281215 -0.0000138 -0.0000048 -0.0000031 -0.1876677 0.1578933 0.1009002 0.000014 0.0822441 0.0260032 0.000006 0.0000118 0.0000055 -0.1293145 0.059042 -0.0543355 0.0000022 -0.0658056 -0.1131255 0. 0. -0.0000003 -0.1694387 0.0549943 -0.0943841 -0.0000093 -0.0549728 -0.0372931 -0.0000115 -0.0000119 -0.0000147 0.163218 0.0858058 0.0610812 0.0000008 0.0167128 -0.0823312 -0.0000099 0.0000028 -0.0000113 0.1547692 0.0962847 -0.0025619 -0.0000022 0.0524916 -0.0293468 -0.0000035 -0.0000032 -0.0000066 0.1595679 0.0159442 0.0862471 -0.0000033 0.1043308 -0.0359556 -0.000003 0.000003 -0.0000055 0.1555185 -0.0435415 -0.0097129 -0.0000108 -0.0130627 0.0998992 -0.0000027 -0.0000105 -0.0000015 0.184611 -0.0505669 -0.0933593 -0.0000089 -0.1133352 0.0102076 -0.0000084 -0.0000121 -0.0000086 0.1558371 -0.1090946 0.054609 -0.0000056 0.0613092 0.0725878 -0.000001 -0.0000033 0.0000013 0.1653702 unknown
polarizability: 223.7638531|-7.5331007|160.3862976|0.006137|0.0024897|52.9203383 unknown
InChI: InChI=1S/C13H7FO/c14-11-7-3-6-9-8-4-1-2-5-10(8)13(15)12(9)11/h1-7H
charge 0 multiplicity 1
22 atoms
F  -3.105605 -1.717548 -0.000129
O  -0.145174 -2.728249 0.000075
C  -0.431081 0.879139 0.000085
C  1.042801 0.677704 0.00014
C  -1.058843 -0.40697 0.000022
C  1.308515 -0.721891 0.00011
C  0.00493 -1.477565 0.000002
C  -1.196642 2.057278 0.000103
C  2.105198 1.598467 0.000208
C  -2.456545 -0.479147 -0.00003
C  2.618168 -1.224836 0.000145
C  -2.613844 1.948268 0.000041
C  -3.252417 0.688743 -0.000027
C  3.434268 1.09601 0.000235
C  3.691908 -0.297185 0.000204
H  -0.722522 3.043749 0.000173
H  1.927069 2.679374 0.000253
H  2.794715 -2.305373 0.00012
H  -3.228015 2.85486 0.00005
H  -4.342552 0.598662 -0.00008
H  4.275084 1.798618 0.000283
H  4.726286 -0.656912 0.000217
