program: Gaussian 09
title: 000245125
version: EM64L-G09RevD.01
frameworkgroup: C1[X(C15H10BrNO2)]
method: RPBEPBE
basis: SDD
operation: Freq
keyword: #p
keyword: freq=noraman
keyword: PBEPBE/SDD
title: #p freq=noraman PBEPBE/SDD
converged: NO YES NO NO
title: Mulliken charges:
elementType: Br O O N C C C C C C C C C C C C C C C H H H H H H H H H H
charge: 0.023273 -0.142839 -0.241817 -0.449688 0.292100 0.257810 0.279887 0.216712 -0.312062 -0.545664 -0.379934 0.705849 -0.394573 -0.551899 -0.415488 -0.217986 -0.231300 0.217345 -0.796634 0.358159 0.264571 0.246430 0.281167 0.232149 0.237404 0.311816 0.242003 0.271213 0.241996
chargesum: 0.00000
title: Mulliken charges with hydrogens summed into heavy atoms:
elementType: Br O O N C C C C C C C C C C C C C C C
charge: 0.023273 -0.142839 -0.241817 -0.137872 0.292100 0.257810 0.279887 0.216712 -0.312062 -0.187505 -0.115362 0.705849 -0.148143 -0.551899 -0.134322 0.014163 0.006104 0.217345 -0.041423
polarizability: 3.47387101e+02 9.10471784e+00 2.24195491e+02 2.77493856e-04 -3.97012051e-03 7.38174804e+01
1716.lowfreq: -66.9134 -4.1376 -0.0006 -0.0002 0.0007 4.8495 5.4618 39.6253 59.1020
frequency: -66.9124 39.6175 59.1003 67.6160 98.1052 111.5613 122.3627 143.0235 209.5197 211.3037 223.3247 224.1342 260.3746 294.0300 362.6794 403.1207 423.2445 440.6801 456.4860 489.6329 521.9529 558.2399 577.0594 589.3980 620.8200 637.1342 661.6889 681.8555 719.1461 721.6051 754.9686 756.4394 780.2136 837.5540 843.2683 885.4559 901.2956 931.4439 958.7223 964.9362 976.4960 997.0606 998.1845 1004.4743 1031.1911 1033.4486 1079.0583 1114.2102 1167.1747 1183.1332 1195.6873 1223.3711 1233.6786 1274.8482 1299.3255 1342.6718 1377.2108 1381.5091 1430.7449 1439.0771 1447.0942 1449.8868 1466.7847 1479.8382 1502.7363 1580.8955 1599.2350 1602.6394 1620.3303 1635.4086 1642.8104 2988.6931 3073.8685 3130.2424 3138.9262 3142.4505 3153.0707 3162.7983 3168.7067 3180.8081 3474.9092
redmass: 1.0406 6.3128 5.0440 7.3042 5.7841 4.5931 9.0962 5.3105 8.2832 5.6184 18.4199 4.9834 6.0453 5.4030 4.8268 6.8332 3.9899 3.0774 5.0369 4.2909 5.8679 6.1055 3.1375 7.1466 4.2173 6.3132 6.7725 1.3942 3.0916 6.4645 1.6672 5.9066 2.4015 3.1770 6.7258 1.4601 1.6072 6.3352 2.6588 1.4011 1.5424 4.1103 1.3640 2.2699 2.0442 1.6668 2.6858 2.3593 1.2972 2.0711 2.7444 2.6486 1.4161 2.0148 2.1676 5.2167 1.2397 4.2947 3.0547 2.7192 2.7017 1.3056 1.0463 4.5535 2.0042 7.2287 7.5452 7.6729 7.8121 7.4690 6.3436 1.0384 1.0983 1.0864 1.0981 1.0899 1.0947 1.0928 1.1003 1.0934 1.0763
irintensity: 0.2547 0.8362 10.4968 0.8890 2.6665 1.2769 1.7707 0.3544 0.6724 0.4497 0.3348 0.4409 8.0716 4.0140 0.0018 1.5933 5.9551 5.5511 15.0182 11.5428 0.6366 3.8848 0.1617 9.3397 3.3055 9.9174 2.7825 32.4839 60.2239 3.2214 37.2762 24.1404 41.7935 0.7219 12.5221 12.4961 0.2931 0.8653 100.8027 2.1858 30.7626 27.4850 0.5180 4.3678 4.5106 8.3010 17.7807 18.0570 9.1153 48.2353 5.5905 77.5232 33.4261 29.6631 75.5317 168.6316 69.5588 50.0202 42.5039 17.4112 136.9993 77.2533 20.5160 47.5926 498.1062 62.6644 113.1339 116.2362 44.1350 4.5710 159.1163 5.9190 12.7764 2.8880 6.8020 5.0214 12.9670 1.2439 33.5146 18.0107 47.2434
temp: 298.150 k
press: 1.00000 atm
elementType: 35 8 8 7 6 6 6 6 6 6 6 6 6 6 6 6 6 6 6 1 1 1 1 1 1 1 1 1 1
symmnumber: 1
zpe: 550089.6 jmol-1
zpe.correction: 0.209518 hartree
zpe.thermalcorrener: 0.224949 hartree
zpe.thermalcorrenthalpy: 0.225893 hartree
zpe.thermalcorrgfe: 0.165252 hartree
zpe.sumelectzpe: -794.988055 hartree
zpe.sumelectthermal: -794.972624 hartree
zpe.sumelectthermalent: -794.971680 hartree
zpe.sumelectthermalfe: -795.032321 hartree
dipole: 1.1392 -5.4910 0.0002
dipole: 5.6080
quadrupole: -84.5113 -133.7173 -122.1921
quadrupole: 7.3877 0.0012 0.0002
quadrupole: 28.9622 -20.2437 -8.7185 7.3877 0.0012 0.0002
hfenergy: -795.1975729 hartree
pointgroup: C01 [X(C15H10Br1N1O2)]
dipole: -0.0405753 2.2059743 0.0031625 debye
polarizability: 346.4785417|-13.9282726|225.1037433|-0.0214865|0.2152342|73.8177865 unknown
InChI: InChI=1S/C15H10BrNO2/c1-8(18)17-14-7-12-11(6-13(14)16)9-4-2-3-5-10(9)15(12)19/h2-7,17H,1H3
charge 0 multiplicity 1
29 atoms
Br -2.560181 3.303231 0.004895
O  1.127221 -2.867613 -0.003684
O  -3.822302 -2.022244 -0.002619
N  -3.471981 0.303996 0.000771
C  0.774704 0.720239 0.001229
C  0.172208 -0.571361 -0.000561
C  2.251417 0.562569 0.000998
C  2.551264 -0.833543 -0.000941
C  1.264061 -1.614345 -0.002107
C  -1.212847 -0.758269 -0.000771
C  -0.040295 1.863581 0.002853
C  -2.062525 0.392671 0.000855
C  3.291972 1.507577 0.002327
C  -1.440081 1.679081 0.00263
C  3.873478 -1.302445 -0.001558
C  4.632611 1.037023 0.001701
C  4.924536 -0.349144 -0.000211
C  -4.280252 -0.845774 -0.000918
C  -5.774885 -0.531422 -0.000335
H  -1.661018 -1.754309 -0.00217
H  0.37667 2.874345 0.004268
H  3.088238 2.583998 0.003827
H  4.077193 -2.378272 -0.003067
H  5.456105 1.759871 0.002723
H  5.967357 -0.683374 -0.000653
H  -3.964027 1.203764 0.00211
H  -6.060227 0.050242 0.895772
H  -6.332759 -1.478339 -0.001736
H  -6.060356 0.05297 -0.894625
