program: Gaussian 09
title: 000245137
version: EM64L-G09RevD.01
frameworkgroup: C1[X(C25H18O2)]
method: RPBEPBE
basis: SDD
operation: Freq
keyword: #pfreq=noraman
keyword: PBEPBE/SDD
title: #p freq=noraman PBEPBE/SDD
converged: YES YES NO NO
title: Mulliken charges:
elementType: O O C C C C C C C C C C C C C C C C C C C C C C C C C H H H H H H H H H H H H H H H H H H
charge: -0.267862 -0.248384 -0.660149 0.368999 0.428632 0.286826 0.222009 -0.021667 0.471990 0.016645 -0.457428 -0.456081 -0.365769 -0.382416 0.131911 -0.407732 -0.404151 -0.240757 -0.232832 -0.268673 -0.249680 0.345137 -0.450056 -0.238797 -0.235847 -0.252163 -0.776799 0.234085 0.235750 0.242951 0.273671 0.260284 0.243836 0.257704 0.227791 0.231770 0.229852 0.232917 0.258542 0.222818 0.228174 0.226454 0.242851 0.243861 0.251785
chargesum: 0.00000
title: Mulliken charges with hydrogens summed into heavy atoms:
elementType: O O C C C C C C C C C C C C C C C C C C C C C C C C C
charge: -0.267862 -0.248384 -0.426064 0.368999 0.428632 0.286826 0.222009 -0.021667 0.471990 0.016645 -0.221678 -0.213130 -0.092098 -0.122132 0.131911 -0.163896 -0.146447 -0.012966 -0.001062 -0.038821 -0.016763 0.345137 -0.191514 -0.015979 -0.007673 -0.025709 -0.038303
polarizability: 3.00067038e+02 -1.42531584e+01 3.07889051e+02 -1.29779882e+00 7.30302231e-01 2.05378813e+02
1716.lowfreq: -10.5124 -1.8969 -0.0007 -0.0002 0.0004 7.7428 31.7838 36.3142 47.0761
frequency: 31.7047 36.2765 47.0584 63.9977 68.5484 90.4065 102.5030 124.3160 147.0989 169.2092 172.2565 181.1790 225.5406 234.4313 254.1829 278.3689 304.1168 322.7869 332.8351 352.4344 388.5682 402.6989 408.4517 447.7538 471.6378 484.8134 496.0678 514.8419 523.1712 563.4569 567.0928 600.6821 608.3838 613.1461 619.5318 627.5846 639.8089 665.1138 687.9892 703.8710 734.0709 738.9591 749.1076 760.0662 769.2443 771.5191 817.6572 847.0865 856.9821 858.6449 867.0743 873.9043 885.0621 895.4466 908.8186 932.4351 948.9438 958.4028 967.6400 983.1956 986.9398 990.7151 992.2338 997.0169 1006.8895 1027.5079 1043.3041 1049.7633 1051.2510 1065.7918 1084.7251 1116.2773 1121.3350 1164.9437 1166.9968 1171.4536 1177.0399 1179.3999 1193.5907 1203.8706 1206.7742 1215.1707 1226.4761 1247.4085 1252.9272 1302.3706 1308.0679 1319.1790 1330.6107 1353.9762 1376.2030 1377.7471 1384.8046 1403.0731 1427.2097 1434.0810 1437.9204 1453.6134 1463.5241 1478.7515 1481.3789 1490.2902 1544.4258 1551.1127 1580.1098 1583.5705 1589.7355 1607.1180 1608.0938 1612.6103 1657.7247 2976.3064 2991.6635 3072.2654 3117.6026 3117.7301 3118.4733 3123.1904 3127.2845 3136.4399 3138.0578 3138.4677 3147.2882 3154.8957 3157.3770 3162.5223 3170.5377 3181.2799 3186.5287
redmass: 4.1456 4.5113 7.0252 5.0933 4.8171 4.3306 4.5642 1.2306 4.1375 3.7348 3.5885 4.0097 5.4506 5.2149 5.4286 4.4044 4.6999 4.4815 6.3441 5.3588 5.0788 2.8649 5.4360 3.8635 3.4862 3.9497 4.4634 9.2978 4.2679 4.4703 5.5147 4.4479 4.5188 5.8466 5.9351 5.7398 6.5018 5.4590 5.3811 2.0654 3.6540 1.7944 2.1633 3.4750 1.5712 1.8185 3.9227 2.8428 1.9161 1.5886 1.6557 1.5116 2.5607 2.8617 4.0683 1.5164 1.4465 1.4879 4.4918 1.3887 1.3355 5.4547 1.3403 1.3403 1.8971 2.2903 2.3997 2.2296 1.5322 3.2182 1.6744 2.0597 2.2334 3.1934 2.5136 1.0514 1.0934 1.1828 1.1186 1.7056 3.5837 1.9455 1.7860 1.9202 1.5056 1.5068 1.6496 2.3243 1.6130 4.4606 7.6625 6.4538 5.2949 1.2665 2.2240 2.2689 2.3648 1.0439 1.0839 2.5317 2.2028 2.6467 9.7280 9.0967 6.6394 7.2955 6.1739 6.1946 6.3050 6.0749 7.4859 1.0830 1.0377 1.0977 1.0989 1.0873 1.0848 1.0870 1.0871 1.0898 1.0920 1.0893 1.0958 1.0943 1.0974 1.1013 1.0993 1.0931 1.0954
irintensity: 0.2137 0.3257 2.9954 0.5329 0.7089 0.9323 0.8136 0.0695 1.0363 1.9007 1.4851 0.0654 0.7908 0.4873 0.5106 0.0434 3.3599 2.3260 1.9873 0.2548 2.6616 0.0351 0.0852 5.6042 6.0458 8.3529 1.9910 0.3083 1.4573 0.9629 0.4968 6.6858 17.2101 2.3498 6.7679 5.4561 1.7410 8.6848 7.9774 35.2574 8.3264 49.0865 11.2824 12.4245 76.6148 24.8934 3.7576 6.0853 2.2741 0.2415 2.7581 24.3571 4.5425 1.4475 11.3459 1.9294 2.6407 2.2922 16.1389 0.0567 0.4291 0.6401 0.2722 0.1682 8.8258 8.6132 10.0504 4.9224 8.1616 31.0718 7.1618 4.4250 5.9994 24.7554 0.2479 0.0545 0.4729 1.5208 2.7449 2.4123 29.1922 22.4296 1.2585 3.5892 11.0260 5.6210 17.4606 44.0364 34.3991 177.3046 1.7563 0.1148 5.4652 35.3038 19.1545 19.6829 0.5504 16.4193 7.0086 4.2075 29.4944 15.6570 113.6722 43.1738 0.5804 3.0250 0.9837 10.8779 7.1632 6.2864 129.6238 14.3798 12.0994 9.1281 10.4013 4.2860 2.4672 3.5948 0.8206 12.2775 18.1810 8.7724 28.0773 22.0466 37.8693 24.9215 22.5011 3.6907 7.1391
temp: 298.150 k
press: 1.00000 atm
elementType: 8 8 6 6 6 6 6 6 6 6 6 6 6 6 6 6 6 6 6 6 6 6 6 6 6 6 6 1 1 1 1 1 1 1 1 1 1 1 1 1 1 1 1 1 1
symmnumber: 1
zpe: 921203.5 jmol-1
zpe.correction: 0.350868 hartree
zpe.thermalcorrener: 0.372059 hartree
zpe.thermalcorrenthalpy: 0.373003 hartree
zpe.thermalcorrgfe: 0.300741 hartree
zpe.sumelectzpe: -1112.086567 hartree
zpe.sumelectthermal: -1112.065376 hartree
zpe.sumelectthermalent: -1112.064432 hartree
zpe.sumelectthermalfe: -1112.136694 hartree
dipole: -2.0746 3.8717 -0.2790
dipole: 4.4013
quadrupole: -131.6514 -155.9599 -151.7665
quadrupole: 3.7885 5.3291 -2.2854
quadrupole: 14.8078 -9.5006 -5.3072 3.7885 5.3291 -2.2854
hfenergy: -1112.4374347 hartree
pointgroup: C01 [X(C25H18O2)]
dipole: 0.4132839 -1.681573 -0.0009097 debye
polarizability: 292.7396388|-11.8264168|313.0847375|-9.1530316|-10.0160073|207.5105267 unknown
InChI: InChI=1S/C25H18O2/c1-16-15-22(26)24-19-12-6-5-11-18(19)23(17-9-3-2-4-10-17)20-13-7-8-14-21(20)25(24)27-16/h2-15,23H,1H3
charge 0 multiplicity 1
45 atoms
O  2.010912 -0.860603 -1.407344
O  0.885603 3.121747 -1.560972
C  -1.274713 -0.419189 1.196243
C  -1.903218 0.617502 0.26308
C  -1.019526 -1.69586 0.393843
C  -1.167877 1.178878 -0.824375
C  -0.068509 -1.717651 -0.670354
C  0.242413 0.806524 -1.113297
C  -0.041009 0.080315 1.983385
C  0.689341 -0.508003 -1.047722
C  -3.249149 1.004065 0.469546
C  -1.729622 -2.881511 0.698425
C  -1.811699 2.133653 -1.661439
C  0.174265 -2.932995 -1.368057
C  1.201698 1.88374 -1.519545
C  0.878896 -0.84885 2.533002
C  0.140233 1.458418 2.259502
C  -3.879896 1.942026 -0.373993
C  -1.498901 -4.079469 -0.010826
C  -3.153195 2.506199 -1.447175
C  -0.53582 -4.105456 -1.046803
C  2.924853 0.117584 -1.814207
C  2.553838 1.433707 -1.864341
C  1.959756 -0.411477 3.330354
C  1.221484 1.8981 3.055186
C  2.136938 0.966046 3.594989
C  4.264103 -0.476344 -2.136232
H  -2.040285 -0.668864 1.958416
H  -3.803435 0.567417 1.309173
H  -2.462449 -2.864604 1.513807
H  -1.249042 2.585894 -2.480406
H  0.918796 -2.942644 -2.169347
H  0.75333 -1.91939 2.332592
H  -0.556515 2.19319 1.841869
H  -4.920455 2.233395 -0.193333
H  -2.057143 -4.986106 0.246984
H  -3.626345 3.237459 -2.1113
H  -0.345209 -5.030465 -1.60121
H  3.276264 2.196495 -2.164581
H  2.661218 -1.144858 3.744862
H  1.350163 2.969078 3.248328
H  2.975975 1.307937 4.21148
H  4.967685 0.311054 -2.448047
H  4.180226 -1.219853 -2.949912
H  4.680926 -0.996936 -1.255048
