program: Gaussian 09
title: 000245109
version: EM64L-G09RevD.01
frameworkgroup: C1[X(C7H5IN2O4)]
method: RPBEPBE
basis: SDD
operation: Freq
keyword: #p
keyword: freq=noraman
keyword: PBEPBE/SDD
title: #p freq=noraman PBEPBE/SDD
converged: YES YES NO NO
title: Mulliken charges:
elementType: I O O O O N N C C C C C C C H H H H H
charge: 0.181645 -0.181769 -0.181801 -0.174515 -0.174428 0.006391 0.006431 0.229321 0.291207 0.291735 -0.283407 -0.283102 -0.738919 -0.357293 0.305138 0.305188 0.278768 0.239867 0.239546
chargesum: 0.00000
title: Mulliken charges with hydrogens summed into heavy atoms:
elementType: I O O O O N N C C C C C C C
charge: 0.181645 -0.181769 -0.181801 -0.174515 -0.174428 0.006391 0.006431 0.229321 0.291207 0.291735 0.021730 0.022086 0.019261 -0.357293
polarizability: 1.98627588e+02 -1.99450384e-02 1.48760909e+02 -9.20891072e+00 2.14210846e-02 5.55999471e+01
1716.lowfreq: -9.4696 -5.9299 -0.0008 -0.0008 -0.0003 5.0993 45.5450 51.1716 89.1586
frequency: 45.5274 51.1713 89.1584 104.6560 106.7259 154.3533 163.6269 171.3020 238.3466 285.2698 311.2162 316.5561 370.9613 397.5919 446.4261 458.2689 532.7034 615.3617 617.1275 664.0639 678.5531 719.6353 724.0925 746.7363 819.5632 846.5052 908.9182 931.0311 1024.0880 1033.8241 1089.1327 1122.6530 1200.9604 1204.2541 1216.4209 1217.7439 1341.1447 1368.1802 1370.8070 1398.1124 1401.4060 1448.0849 1448.2496 1475.2601 1549.9085 1588.6681 3016.1579 3100.8379 3130.4225 3183.1940 3184.9542
redmass: 10.5625 10.3304 8.0773 5.9043 13.9948 1.1640 13.6670 5.2881 11.6091 4.9842 5.6938 10.9023 3.3610 7.7198 7.0339 4.5517 4.7806 6.6420 5.2582 7.1034 11.5421 8.3399 4.2042 8.5615 7.3438 7.6229 1.5512 1.4134 1.5112 1.5457 2.7219 5.0401 6.7535 3.2502 8.4909 1.7545 3.1322 9.9988 6.4421 6.5698 1.2050 1.1375 3.1114 1.1328 6.6258 8.4246 1.0388 1.0946 1.1014 1.0925 1.0940
irintensity: 0.4273 0.9433 4.2532 0.6038 0.0936 2.1120 2.6103 0.1211 4.7181 0.6034 0.8370 1.1275 0.5803 0.3439 3.6328 0.0005 19.0864 14.1824 0.3340 23.9886 36.1823 0.1538 10.8866 6.1956 18.5961 31.0235 30.1938 2.6765 1.2837 2.8668 17.1998 20.8422 221.0200 28.7743 59.7932 120.0560 10.8640 14.9193 138.5227 14.9119 76.6968 17.8675 127.0419 22.3594 9.8387 12.9919 1.4698 7.2337 8.1876 10.9293 1.3033
temp: 298.150 k
press: 1.00000 atm
elementType: 53 8 8 8 8 7 7 6 6 6 6 6 6 6 1 1 1 1 1
symmnumber: 1
zpe: 308815.5 jmol-1
zpe.correction: 0.117622 hartree
zpe.thermalcorrener: 0.130660 hartree
zpe.thermalcorrenthalpy: 0.131604 hartree
zpe.thermalcorrgfe: 0.075413 hartree
zpe.sumelectzpe: -690.458109 hartree
zpe.sumelectthermal: -690.445071 hartree
zpe.sumelectthermalent: -690.444127 hartree
zpe.sumelectthermalfe: -690.500318 hartree
dipole: -2.1292 -0.0016 0.0996
dipole: 2.1315
quadrupole: -94.0530 -117.8051 -95.4850
quadrupole: -0.0115 4.1560 0.0070
quadrupole: 8.3947 -15.3574 6.9627 -0.0115 4.1560 0.0070
hfenergy: -690.5757311 hartree
pointgroup: C01 [X(C7H5I1N2O4)]
dipole: 0.0024861 0.8373531 -0.0456286 debye
dipolederiv: 0.0427215 -0.0018321 0.0007298 -0.0027302 -0.4694269 -0.0080326 0.0007384 -0.0161191 0.0616696 -0.7911876 0.0575875 -0.1570036 0.0502163 -0.4143692 0.1501399 -0.096332 0.1475349 -0.3124989 -0.7649549 -0.0408604 0.1993068 -0.0333396 -0.4139768 0.1520179 0.1389037 0.150761 -0.3389629 -0.5146183 -0.1908703 0.0187809 -0.0827775 -0.6546251 0.2367838 -0.0538851 0.216604 -0.3226554 -0.5068964 0.2083337 0.0004313 0.1025981 -0.6577311 0.2279911 0.0732433 0.1971879 -0.3268736 1.4748997 0.3238998 0.1619333 0.2321053 0.8549192 -0.4662732 0.1517131 -0.4115943 0.4314983 1.4318749 -0.3652237 -0.2576824 -0.2786676 0.8618547 -0.4403236 -0.2473315 -0.3776477 0.4674335 0.1295352 0.0040116 -0.0041993 0.0023883 0.3117048 0.0435569 -0.0037637 0.084883 0.0325949 -0.313847 -0.1405794 -0.0185861 -0.1848008 -0.1399484 0.0569305 -0.0116102 0.0174633 0.0198525 -0.3053962 0.1432556 0.0487733 0.1912093 -0.1435198 0.039672 0.0416483 0.0045624 0.0142715 0.0625901 -0.0213612 0.0043579 0.1806418 -0.3473854 -0.0055929 -0.0591495 -0.0422753 -0.0113864 0.0653885 0.0131513 -0.0110878 -0.1845937 -0.3454736 0.0109392 0.051707 -0.0442565 -0.015854 0.1195558 0.0040563 -0.0022729 -0.0001596 -0.2754255 0.0134612 -0.0033131 0.0732883 0.0615698 -0.3846842 0.0076197 0.0091736 0.0089399 1.3566372 0.01856 0.0089923 0.0149887 -0.1861243 0.0967904 0.0493594 0.0064093 0.0120428 0.123336 -0.0116458 0.0196526 0.0248186 0.1590521 0.0944254 -0.0464576 -0.0007197 -0.012877 0.1241069 -0.010486 -0.0133519 0.029301 0.1609079 0.1185042 0.0005578 -0.0066853 0.0007429 0.0694811 0.0202458 -0.0061384 0.0147752 -0.005681 -0.0349402 -0.0599828 -0.0806081 -0.0087829 0.0805461 -0.0133831 -0.0633023 -0.0391186 0.0633582 -0.019761 0.0553347 0.0889487 0.0078441 0.0792959 -0.0145612 0.0715791 -0.0451565 0.0478283 unknown
polarizability: 148.5660494|-0.255086|198.4800293|-4.262894|-10.2828656|55.9423654 unknown
InChI: InChI=1S/C7H5IN2O4/c1-4-6(9(11)12)2-5(8)3-7(4)10(13)14/h2-3H,1H3
charge 0 multiplicity 1
19 atoms
I  0.030701 4.184163 0.080811
O  -3.523263 -0.070822 -0.348263
O  3.490672 -0.101585 -0.667488
O  -2.626466 -1.838566 0.778624
O  2.684417 -1.863815 0.534006
N  -2.527126 -0.708492 0.167012
N  2.539961 -0.731495 -0.06435
C  0.003648 -0.853345 0.004856
C  -1.182595 -0.0661 0.079918
C  1.198998 -0.076859 -0.027867
C  -1.200485 1.346373 0.09141
C  1.230639 1.335227 -0.018004
C  -0.00804 -2.362703 -0.121296
C  0.018712 2.046499 0.046051
H  -2.164234 1.859728 0.129336
H  2.198372 1.839947 -0.067393
H  0.041928 -2.836754 0.874305
H  -0.933005 -2.715713 -0.600581
H  0.861365 -2.720885 -0.692285
