program: Gaussian 09
title: 000245101
version: EM64L-G09RevD.01
frameworkgroup: C1[X(C13H12N2)]
method: RPBEPBE
basis: SDD
operation: Freq
keyword: #pfreq=noraman
keyword: PBEPBE/SDD
title: #p freq=noraman PBEPBE/SDD
converged: YES YES NO NO
title: Mulliken charges:
elementType: N N C C C C C C C C C C C C C H H H H H H H H H H H H
charge: -0.565029 -0.705196 -0.423725 0.317665 0.272739 0.144424 0.189911 -0.646318 -0.379882 -0.434344 -0.405895 0.542682 -0.448506 -0.247326 -0.232493 0.243441 0.259894 0.233804 0.232767 0.235089 0.275514 0.270877 0.214549 0.221862 0.221461 0.303891 0.308144
chargesum: 0.00000
title: Mulliken charges with hydrogens summed into heavy atoms:
elementType: N N C C C C C C C C C C C C C
charge: -0.018637 -0.093161 -0.180284 0.317665 0.272739 0.144424 0.189911 -0.386424 -0.146079 -0.201577 -0.170806 0.542682 -0.233957 -0.025464 -0.011032
polarizability: 2.63217050e+02 -1.87889169e+00 1.58923458e+02 -8.57592538e-01 -6.62875114e+00 6.96280281e+01
1716.lowfreq: -5.9489 -0.0009 0.0000 0.0005 3.4427 9.7646 66.7666 111.7516 129.0906
frequency: 66.7633 111.7476 129.0898 173.9942 180.7286 235.9301 270.7797 331.9188 340.3090 356.7354 369.7629 378.5975 397.7639 442.2198 463.9737 520.5400 545.4242 557.3222 583.1552 597.9496 655.1894 663.5760 717.7852 723.0489 743.7707 765.1854 782.6339 817.9575 833.5726 873.4304 887.0355 925.9674 939.1332 940.5011 978.4929 992.7704 1023.3892 1033.8231 1042.7745 1099.9645 1131.6896 1137.3262 1155.0822 1167.1452 1183.7848 1203.4578 1227.6565 1276.4324 1300.8434 1323.6522 1348.9096 1377.6879 1397.5414 1442.9847 1459.6885 1473.2115 1498.5655 1588.6786 1593.4159 1614.7755 1631.8408 1640.1030 1646.0035 2963.5867 3109.9107 3115.0461 3121.0644 3130.9685 3136.1764 3140.8440 3156.8460 3442.7574 3566.7844 3573.6193 3707.9383
redmass: 4.3597 3.5004 3.4279 4.1865 3.7964 2.9780 1.3289 3.7259 3.5069 1.3436 2.6801 1.1490 3.8907 2.8448 3.4862 4.3916 4.6241 3.1745 3.3563 3.3027 2.6659 3.1078 4.4212 4.7746 1.6343 3.4420 2.3936 1.6008 3.2267 1.5327 1.5819 2.8342 1.4276 1.3860 1.3205 6.4712 2.0017 1.5028 2.8326 1.7964 1.3974 1.6808 1.4441 1.1955 2.2576 1.5976 1.6157 1.5992 1.8333 2.1340 1.6454 7.5810 3.3822 2.6032 2.9958 4.8261 4.3320 7.3270 6.6226 6.9916 1.5508 1.1936 2.3460 1.0820 1.0872 1.0869 1.0876 1.0919 1.0937 1.0964 1.1000 1.0446 1.0448 1.0977 1.1040
irintensity: 1.9963 6.1154 1.6646 1.0138 3.5643 2.7048 57.8434 7.4445 12.4385 285.6557 6.9491 10.8731 0.8952 0.8412 14.5089 4.1785 3.1392 41.2190 26.8480 23.2135 84.8283 45.8981 9.7458 4.2612 64.0249 25.8144 17.7722 34.6482 24.6207 5.8665 26.0650 2.4187 1.9971 0.0966 0.0285 0.1203 9.6416 2.2998 8.9009 2.3934 16.5765 4.3616 4.4733 4.4398 15.3496 4.1503 7.7574 3.0044 7.9691 74.4224 11.8391 22.3543 1.5947 29.2136 70.1340 48.7632 56.2411 8.5188 5.1504 64.1952 29.8212 53.6199 334.3338 16.3044 12.2520 19.5617 1.9049 15.2892 21.9875 36.7006 44.0563 1.7690 103.5207 0.9378 20.0118
temp: 298.150 k
press: 1.00000 atm
elementType: 7 7 6 6 6 6 6 6 6 6 6 6 6 6 6 1 1 1 1 1 1 1 1 1 1 1 1
symmnumber: 1
zpe: 571101.6 jmol-1
zpe.correction: 0.217521 hartree
zpe.thermalcorrener: 0.229806 hartree
zpe.thermalcorrenthalpy: 0.230750 hartree
zpe.thermalcorrgfe: 0.179814 hartree
zpe.sumelectzpe: -611.060569 hartree
zpe.sumelectthermal: -611.048284 hartree
zpe.sumelectthermalent: -611.047340 hartree
zpe.sumelectthermalfe: -611.098276 hartree
dipole: -1.9155 0.5402 0.3808
dipole: 2.0263
quadrupole: -64.4030 -77.4331 -92.5103
quadrupole: 3.7113 0.3072 -1.2898
quadrupole: 13.7125 0.6824 -14.3949 3.7113 0.3072 -1.2898
hfenergy: -611.2780898 hartree
pointgroup: C01 [X(C13H12N2)]
dipole: -0.7536965 0.2111821 0.1513263 debye
polarizability: 263.1988062|-1.1442354|158.3500956|-2.9599645|-9.6190591|70.2196343 unknown
InChI: InChI=1S/C13H12N2/c14-8-5-6-10-9-3-1-2-4-11(9)13(15)12(10)7-8/h1-7,13H,14-15H2
charge 0 multiplicity 1
27 atoms
N  0.14836 2.829144 0.440906
N  -4.569713 0.107634 0.012336
C  0.257423 1.631161 -0.417434
C  -0.899788 0.646387 -0.213399
C  1.487601 0.712582 -0.243111
C  -0.403755 -0.679025 -0.034522
C  1.07106 -0.63989 -0.0463
C  -2.268467 0.92875 -0.196425
C  -1.317164 -1.741429 0.141856
C  2.849916 1.047974 -0.270286
C  2.032266 -1.662995 0.114317
C  -3.195329 -0.143014 -0.011065
C  -2.7019 -1.474513 0.149746
C  3.816935 0.021738 -0.1004
C  3.406393 -1.321196 0.086262
H  0.237858 1.996201 -1.466202
H  -2.618098 1.961765 -0.307659
H  -0.965306 -2.770631 0.277514
H  3.171175 2.086608 -0.419318
H  1.727414 -2.705513 0.261928
H  0.815215 3.571358 0.20502
H  0.163193 2.607296 1.442638
H  -3.41598 -2.295979 0.28861
H  4.885025 0.266783 -0.115676
H  4.163044 -2.104321 0.212698
H  -5.23531 -0.646986 0.149138
H  -4.926967 1.051809 -0.09777
