program: Gaussian 09
title: 000245094
version: EM64L-G09RevD.01
frameworkgroup: C1[X(C15H10ClNO2)]
method: RPBEPBE
basis: SDD
operation: Freq
keyword: #p
keyword: freq=noraman
keyword: PBEPBE/SDD
title: #p freq=noraman PBEPBE/SDD
converged: NO YES NO NO
title: Mulliken charges:
elementType: Cl O O N C C C C C C C C C C C C C C C H H H H H H H H H H
charge: -0.053207 -0.143010 -0.242440 -0.444521 0.320676 0.244438 0.275873 0.216939 -0.311126 -0.546142 -0.427146 0.685499 -0.391079 -0.439608 -0.414470 -0.217642 -0.231119 0.218626 -0.796633 0.356389 0.270551 0.245994 0.281221 0.232158 0.237414 0.318954 0.241116 0.271184 0.241114
chargesum: 0.00000
title: Mulliken charges with hydrogens summed into heavy atoms:
elementType: Cl O O N C C C C C C C C C C C C C C C
charge: -0.053207 -0.143010 -0.242440 -0.125567 0.320676 0.244438 0.275873 0.216939 -0.311126 -0.189753 -0.156595 0.685499 -0.145086 -0.439608 -0.133249 0.014515 0.006295 0.218626 -0.043218
polarizability: 3.39285477e+02 2.17732705e+00 2.08547694e+02 2.11236224e-04 2.12400941e-04 7.29906358e+01
1716.lowfreq: -72.1429 -0.0010 0.0017 0.0020 2.5806 3.9238 9.0282 40.0690 62.2362
frequency: -72.1426 40.0398 62.2339 80.2467 101.0958 112.3164 143.7623 155.2139 221.3485 221.6758 225.0775 252.6359 287.4085 310.3630 364.6253 412.4777 424.0384 440.4750 478.7961 489.4697 522.7253 559.4970 578.3662 599.3410 621.1904 637.9724 666.1634 686.4699 717.9452 722.5056 754.2548 764.0288 779.5619 837.3962 846.0817 881.9945 900.6763 931.7888 961.3926 964.8692 975.9597 998.2067 1003.1387 1005.6101 1031.2162 1032.9537 1079.7818 1114.3750 1166.9614 1183.0189 1197.2090 1223.6560 1231.8057 1276.4257 1301.9719 1348.5542 1378.0977 1384.1455 1434.6316 1441.5288 1448.2765 1450.4534 1466.5469 1481.3954 1504.9372 1584.7021 1600.0883 1603.3928 1621.4977 1634.4404 1642.1054 2990.1111 3075.4435 3129.7872 3139.8045 3142.6310 3153.0252 3163.6737 3168.6427 3182.3461 3484.5470
redmass: 1.0387 6.3242 5.0003 7.8718 5.6567 4.7678 5.4335 8.1297 5.6889 8.8658 5.0511 9.0731 5.4853 9.3939 4.8429 6.1250 4.0037 3.0877 5.7925 4.3341 5.7882 6.3959 3.1486 6.8238 4.4467 6.1180 7.0948 1.4728 2.6810 6.4152 1.6957 5.7545 2.3561 3.1940 6.9164 1.4698 1.5727 6.3858 2.5114 1.3984 1.5364 1.3638 3.8679 2.3249 2.1364 1.6673 2.6176 2.3721 1.2924 2.0594 2.7854 2.4727 1.4411 1.8978 2.4085 5.3077 1.2412 4.2634 2.3154 3.6254 2.7468 1.3319 1.0464 4.6912 2.0374 7.2454 7.4861 7.6353 7.8170 7.1335 6.4961 1.0384 1.0983 1.0864 1.0981 1.0900 1.0947 1.0931 1.1002 1.0937 1.0763
irintensity: 0.1586 0.5998 9.6001 1.4517 2.6817 1.6664 0.4739 3.1606 0.1261 0.3369 0.4258 5.4086 0.1911 6.5529 0.0106 4.0924 5.1904 4.7956 17.9291 10.9368 0.7895 2.0301 0.3242 8.2064 2.8944 9.6958 2.9920 29.0233 65.9807 1.5731 36.1169 23.5487 44.7852 0.5575 12.3253 15.2023 0.0346 0.5321 88.8366 2.7235 30.1607 0.4959 9.0765 25.1726 6.8161 8.4262 17.9803 18.2945 9.7792 44.3473 5.2743 77.7045 33.5246 22.0289 86.1650 157.5116 69.0114 45.5468 40.9261 12.5364 134.9428 78.2485 20.5694 60.9353 492.7857 61.7649 99.3180 123.6237 41.2357 3.6705 156.8726 6.0201 12.7602 2.9650 6.6754 5.4533 13.2945 0.7068 32.4375 15.9278 40.7664
temp: 298.150 k
press: 1.00000 atm
elementType: 17 8 8 7 6 6 6 6 6 6 6 6 6 6 6 6 6 6 6 1 1 1 1 1 1 1 1 1 1
symmnumber: 1
zpe: 551685.5 jmol-1
zpe.correction: 0.210126 hartree
zpe.thermalcorrener: 0.225278 hartree
zpe.thermalcorrenthalpy: 0.226222 hartree
zpe.thermalcorrgfe: 0.166946 hartree
zpe.sumelectzpe: -1241.589348 hartree
zpe.sumelectthermal: -1241.574196 hartree
zpe.sumelectthermalent: -1241.573251 hartree
zpe.sumelectthermalfe: -1241.632528 hartree
dipole: -0.3366 5.5451 0.0000
dipole: 5.5553
quadrupole: -81.3403 -129.1999 -119.2877
quadrupole: -0.2200 0.0001 0.0000
quadrupole: 28.6023 -19.2572 -9.3451 -0.2200 0.0001 0.0000
hfenergy: -1241.7994736 hartree
pointgroup: C01 [X(C15H10Cl1N1O2)]
dipole: 0.004923 2.1856058 0.0026166 debye
polarizability: 339.0424198|-6.0380814|208.7905589|0.0054978|0.161263|72.9908279 unknown
InChI: InChI=1S/C15H10ClNO2/c1-8(18)17-14-7-12-11(6-13(14)16)9-4-2-3-5-10(9)15(12)19/h2-7,17H,1H3
charge 0 multiplicity 1
29 atoms
Cl -2.493566 3.176054 0.003577
O  1.117876 -2.869068 -0.003476
O  -3.84652 -1.99218 -0.002584
N  -3.473202 0.329307 0.000136
C  0.774147 0.719928 0.000829
C  0.168092 -0.570943 -0.000735
C  2.250283 0.558259 0.000711
C  2.546909 -0.838516 -0.000936
C  1.257536 -1.615857 -0.001933
C  -1.218275 -0.756436 -0.001025
C  -0.037325 1.865947 0.002154
C  -2.062307 0.397163 0.000295
C  3.293234 1.500698 0.00188
C  -1.433876 1.677957 0.001845
C  3.867866 -1.310783 -0.001437
C  4.632785 1.026824 0.00138
C  4.92134 -0.36003 -0.000256
C  -4.293409 -0.811109 -0.001216
C  -5.78503 -0.482339 -0.000892
H  -1.668323 -1.751456 -0.002246
H  0.375502 2.878498 0.003393
H  3.092133 2.577593 0.003149
H  4.068572 -2.387153 -0.00272
H  5.458162 1.747528 0.002275
H  5.963416 -0.696566 -0.000608
H  -3.950151 1.236967 0.001195
H  -6.065403 0.102223 0.894848
H  -6.351242 -1.424176 -0.002046
H  -6.065324 0.104365 -0.895257
