program: Gaussian 09
title: 000245096
version: EM64L-G09RevD.01
frameworkgroup: C1[X(C15H9F3N2O3)]
method: RPBEPBE
basis: SDD
operation: Freq
keyword: #p
keyword: freq=noraman
keyword: PBEPBE/SDD
title: #p freq=noraman PBEPBE/SDD
converged: YES YES NO NO
title: Mulliken charges:
elementType: F F F O O O N N C C C C C C C C C C C C C C C H H H H H H H H H
charge: -0.175823 -0.132592 -0.136915 -0.205567 -0.206389 -0.203170 -0.360113 0.016460 -0.367176 0.308260 0.299769 0.186462 0.165570 -0.584136 -0.416622 -0.357280 -0.376812 0.416948 -0.392055 -0.226680 -0.225757 0.195209 0.288893 0.294884 0.350304 0.310728 0.263015 0.255252 0.248006 0.291239 0.238648 0.237442
chargesum: 0.00000
title: Mulliken charges with hydrogens summed into heavy atoms:
elementType: F F F O O O N N C C C C C C C C C C C C C C C
charge: -0.175823 -0.132592 -0.136915 -0.205567 -0.206389 -0.203170 -0.009809 0.016460 -0.072292 0.308260 0.299769 0.186462 0.165570 -0.273408 -0.153607 -0.102029 -0.128806 0.416948 -0.100816 0.011967 0.011685 0.195209 0.288893
polarizability: 2.53625851e+02 4.54199684e+01 2.68219703e+02 2.50743576e+01 -1.84917797e+01 1.00211622e+02
1716.lowfreq: -5.2391 0.0003 0.0008 0.0008 1.9501 4.3935 11.2249 24.5880 31.1825
frequency: 10.8830 24.5837 31.1755 39.7604 58.3136 64.2718 123.0589 131.2995 159.5944 173.8639 196.2979 210.6037 254.4036 274.7986 293.8487 315.0033 329.2468 372.7241 391.0330 433.3242 441.5959 446.4275 480.2218 494.9060 499.3115 542.6597 555.5610 578.2861 598.9543 625.4899 639.4173 662.1915 665.9866 699.9236 709.0594 725.7342 739.6653 755.3653 761.3747 790.3857 812.6753 860.3077 874.5718 897.8621 916.0477 954.9046 961.6502 993.8515 996.3131 997.9429 1007.7644 1026.6234 1039.7847 1040.1312 1071.9591 1100.9130 1124.8698 1132.3623 1172.2215 1184.2334 1197.9802 1201.3299 1210.4674 1240.7858 1243.4653 1280.8902 1303.1917 1317.3477 1361.5222 1387.3862 1407.5774 1435.3814 1444.5992 1463.7851 1486.3915 1491.6528 1592.7783 1594.1699 1617.3253 1619.0194 1647.4352 2992.3030 3133.3009 3140.2906 3151.5429 3153.0042 3169.6933 3172.1693 3185.1618 3532.0436
redmass: 13.2976 14.8183 12.5789 7.5456 7.9095 8.1227 6.9443 4.7404 6.1476 7.3855 8.5040 8.8766 8.0212 12.4900 7.9503 7.5087 4.9844 12.2190 4.6044 3.6673 14.6154 3.4816 7.4228 8.4442 7.1203 5.5397 3.6179 5.5288 3.1102 8.4853 7.7994 2.2103 2.6414 6.1269 10.0615 5.4528 4.3549 1.8629 6.7480 2.2620 6.1434 1.5192 2.1438 2.2684 3.0244 1.6533 1.5019 1.3713 5.9183 1.3763 9.6198 2.1524 6.3994 9.7060 2.1580 2.3441 1.9134 2.6934 1.2784 1.8564 2.5467 1.7798 3.5124 2.1838 1.8942 1.5910 1.7590 1.5499 9.4723 7.4007 4.3313 3.1085 3.0838 2.8414 4.6264 1.8087 8.1516 6.8174 7.2453 7.6350 10.6848 1.0814 1.0862 1.0901 1.0924 1.0933 1.1004 1.0930 1.0951 1.0783
irintensity: 1.3573 1.5553 0.4696 0.1494 0.4661 0.2226 1.0902 0.4719 1.0624 4.7512 6.3751 5.3237 2.6745 7.5954 0.8060 1.0191 0.1868 2.5909 4.8311 12.9973 5.8990 1.0470 4.0903 3.4184 4.2312 0.9522 0.1724 35.7946 6.2706 10.6627 1.4291 34.7914 51.5768 9.9640 5.5780 5.4816 26.7951 42.6703 4.3876 54.1602 5.0253 24.9856 14.1390 7.7374 32.0440 7.3342 3.0002 1.2999 3.3754 0.6882 150.8618 2.7811 83.5197 152.5101 47.4838 67.5946 57.3859 121.0708 6.2564 14.7228 43.2726 113.6099 367.7979 26.3433 59.3663 2.8775 4.3462 9.8525 88.9368 5.7329 21.4676 13.7079 34.9758 7.0350 7.7065 151.8182 11.8811 0.7270 69.1864 24.0077 292.3106 26.9131 1.6437 1.3877 1.1304 20.5016 27.9011 2.9853 2.0591 49.9560
temp: 298.150 k
press: 1.00000 atm
elementType: 9 9 9 8 8 8 7 7 6 6 6 6 6 6 6 6 6 6 6 6 6 6 6 1 1 1 1 1 1 1 1 1
symmnumber: 1
zpe: 566082.4 jmol-1
zpe.correction: 0.215609 hartree
zpe.thermalcorrener: 0.234511 hartree
zpe.thermalcorrenthalpy: 0.235455 hartree
zpe.thermalcorrgfe: 0.164582 hartree
zpe.sumelectzpe: -1210.031808 hartree
zpe.sumelectthermal: -1210.012906 hartree
zpe.sumelectthermalent: -1210.011962 hartree
zpe.sumelectthermalfe: -1210.082836 hartree
dipole: 0.0299 8.0595 -2.0476
dipole: 8.3156
quadrupole: -150.0840 -130.0881 -135.3971
quadrupole: -9.3153 -1.5400 -0.0791
quadrupole: -11.5609 8.4349 3.1260 -9.3153 -1.5400 -0.0791
hfenergy: -1210.2474175 hartree
pointgroup: C01 [X(C15H9F3N2O3)]
dipole: 0.9120962 -3.0448269 0.7749424 debye
polarizability: 276.8524663|-43.4436848|243.0956123|-26.0680167|-23.1809521|102.109097 unknown
InChI: InChI=1S/C15H9F3N2O3/c16-15(17,18)14(21)19-13-11-4-2-1-3-9(11)10-6-5-8(20(22)23)7-12(10)13/h1-7,13,19H
charge 0 multiplicity 1
32 atoms
F  2.552349 2.606627 1.679566
F  2.35802 4.151064 0.02207
F  4.192419 2.823097 0.120253
O  2.233948 1.883894 -1.876008
O  -5.371856 0.898602 0.471727
O  -3.876183 2.47674 -0.222328
N  1.378916 0.863665 0.059136
N  -4.18433 1.270207 0.12313
C  0.664756 -0.213738 -0.648587
C  -0.810513 -0.340587 -0.257822
C  1.203499 -1.620303 -0.362504
C  -1.098311 -1.684223 0.136485
C  0.1461 -2.47304 0.07198
C  -1.803638 0.643508 -0.270094
C  2.513741 -2.103241 -0.499502
C  -2.410288 -2.051621 0.51126
C  0.397219 -3.830978 0.366105
C  -3.108265 0.25155 0.119796
C  -3.424639 -1.073008 0.503773
C  2.766566 -3.465374 -0.196234
C  1.717393 -4.319174 0.229433
C  2.101422 1.808152 -0.626672
C  2.799913 2.849488 0.293044
H  0.768476 0.02815 -1.726151
H  1.353828 0.885081 1.082385
H  -1.614714 1.679226 -0.565429
H  3.325294 -1.449068 -0.83606
H  -2.645452 -3.078469 0.808008
H  -0.407064 -4.49794 0.694701
H  -4.453381 -1.307347 0.789398
H  3.781779 -3.86423 -0.294789
H  1.934594 -5.368708 0.454933
