program: Gaussian 09
title: 000245076
version: EM64L-G09RevD.01
frameworkgroup: C1[X(C12H14ClN3)]
method: RPBEPBE
basis: SDD
operation: Freq
keyword: #p
keyword: freq=noraman
keyword: PBEPBE/SDD
title: #p freq=noraman PBEPBE/SDD
converged: NO YES NO NO
title: Mulliken charges:
elementType: Cl N N N C C C C C C C C C C C C H H H H H H H H H H H H H H
charge: -0.060794 -0.421071 -0.047581 -0.554387 -0.329655 -0.439605 0.370890 0.274659 -0.381445 -0.026710 -0.324898 -0.336326 -0.294685 -0.385448 -0.275390 -0.088912 0.219150 0.219162 0.204727 0.204917 0.310140 0.209245 0.209235 0.235588 0.194953 0.286823 0.233855 0.254856 0.269349 0.269359
chargesum: 0.00000
title: Mulliken charges with hydrogens summed into heavy atoms:
elementType: Cl N N N C C C C C C C C C C C C
charge: -0.060794 -0.110932 -0.047581 -0.015679 0.108657 -0.029961 0.370890 0.274659 0.037035 -0.026710 -0.089309 -0.141373 -0.007863 -0.151593 -0.020534 -0.088912
polarizability: 2.51229911e+02 -1.69320502e+01 1.78487777e+02 -2.39463872e-02 6.52595984e-03 7.95983027e+01
1716.lowfreq: -8.0578 -4.0171 -0.0016 -0.0010 0.0010 2.0851 28.5205 42.5062 54.3813
frequency: 28.1764 42.1935 54.3733 73.3585 110.3618 124.0589 150.8984 162.5655 216.7751 230.4562 244.5432 266.3245 280.6517 333.7839 347.5710 389.1909 428.5451 434.8733 500.1847 502.1582 518.4874 546.7553 576.9904 615.5053 641.6332 643.1578 744.3535 746.7424 758.9136 806.5254 819.4200 833.0336 847.4574 866.8499 896.7811 930.5737 950.3404 992.5152 996.4284 1032.0305 1056.9927 1062.7789 1090.9968 1103.0558 1141.6560 1163.1309 1171.5483 1208.4643 1243.4417 1258.5575 1264.3348 1285.7909 1312.8342 1329.9363 1334.3973 1346.8234 1357.6368 1377.1572 1391.6709 1416.6170 1440.0444 1458.1673 1468.2162 1471.5717 1497.5106 1532.1961 1560.3370 1584.6775 1610.3691 1643.3491 2936.2445 2962.2507 2975.2291 2983.4822 3016.9686 3049.7405 3116.2854 3118.3490 3174.1171 3174.8779 3184.2285 3476.0655 3583.3439 3604.3603
redmass: 5.0160 1.6270 5.7808 4.4500 3.0613 3.0342 2.5461 5.4568 5.7071 5.6602 4.7408 1.0800 4.5077 7.5049 1.3752 3.8918 2.5770 2.9255 5.1712 3.3748 3.7479 1.9499 7.2805 5.9369 3.3070 6.6930 5.3043 1.0930 1.7676 2.2618 1.4564 6.5177 1.2126 6.0441 1.5012 1.3507 1.4100 5.6815 1.1296 3.5687 3.2520 2.0249 2.7501 3.1661 2.5080 1.3987 1.7571 2.1704 1.4677 1.3120 1.3194 1.0842 2.2793 1.8747 1.1635 1.7199 1.4458 2.1311 4.2995 2.5369 2.4710 1.0816 2.1873 1.1568 1.0858 5.2336 3.8060 6.5998 6.6150 1.0904 1.0571 1.0582 1.1030 1.0600 1.1028 1.1064 1.0884 1.0899 1.0932 1.0948 1.0932 1.0445 1.0765 1.0987
irintensity: 1.5816 0.9009 0.7661 1.9583 0.1543 0.0067 4.8480 1.1245 4.3425 2.5905 0.0239 55.9662 3.0202 8.0598 55.7826 4.9903 29.8588 40.6265 14.8706 4.9838 40.8789 327.1929 2.2270 0.1018 8.1599 17.4671 11.4617 5.9423 22.3958 38.4039 18.2119 54.2058 8.0712 40.7292 25.6594 0.0356 1.2945 9.3942 0.0006 14.7592 0.7218 19.4188 1.6501 49.0467 18.3759 0.3665 5.8454 15.6335 3.4749 0.2627 9.7335 0.0001 11.1155 26.6396 0.1623 40.5954 45.9037 1.2335 66.6904 6.6833 45.4025 4.1683 66.3154 1.4588 45.9292 60.2927 125.9652 365.3713 79.5916 34.7585 41.0454 16.5517 18.1521 62.7704 8.9399 82.6555 17.8941 29.2922 21.3936 5.0639 0.8302 1.4255 29.8746 1.3815
temp: 298.150 k
press: 1.00000 atm
elementType: 17 7 7 7 6 6 6 6 6 6 6 6 6 6 6 6 1 1 1 1 1 1 1 1 1 1 1 1 1 1
symmnumber: 1
zpe: 629387.3 jmol-1
zpe.correction: 0.239721 hartree
zpe.thermalcorrener: 0.255329 hartree
zpe.thermalcorrenthalpy: 0.256273 hartree
zpe.thermalcorrgfe: 0.195173 hartree
zpe.sumelectzpe: -1088.823178 hartree
zpe.sumelectthermal: -1088.807570 hartree
zpe.sumelectthermalent: -1088.806626 hartree
zpe.sumelectthermalfe: -1088.867726 hartree
dipole: -5.7482 -3.0999 0.0007
dipole: 6.5308
quadrupole: -117.7541 -96.5483 -103.9281
quadrupole: 2.6082 0.0100 -0.0008
quadrupole: -11.6773 9.5285 2.1487 2.6082 0.0100 -0.0008
hfenergy: -1089.0628993 hartree
pointgroup: C01 [X(C12H14Cl1N3)]
dipole: 2.3154061 1.1138931 0.00026 debye
polarizability: 249.5131537|-20.2145411|180.2045342|0.0236196|-0.0076245|79.5983027 unknown
InChI: InChI=1S/C12H14ClN3/c13-9-2-3-10-11(15-6-1-5-14)4-7-16-12(10)8-9/h2-4,7-8,15H,1,5-6,14H2
charge 0 multiplicity 1
30 atoms
Cl -5.24665 1.797473 -0.000888
N  1.526222 0.220206 0.000284
N  -1.985013 -2.239199 -0.00033
N  6.44556 1.311036 -0.000467
C  2.893161 -0.31754 0.000757
C  3.93241 0.820069 -0.000574
C  0.389557 -0.566245 0.000135
C  -0.936821 0.037043 -0.000177
C  5.393583 0.284337 0.000615
C  -2.081782 -0.851316 -0.000345
C  0.462054 -1.978658 0.00019
C  -1.165191 1.448766 -0.000334
C  -3.4020 -0.292865 -0.000561
C  -0.733627 -2.746558 -0.000086
C  -2.458393 1.982389 -0.000543
C  -3.563811 1.087294 -0.000632
H  3.046797 -0.960854 0.893773
H  3.046493 -0.962601 -0.891015
H  3.784891 1.462525 0.891999
H  3.785309 1.460019 -0.894983
H  1.428114 1.233871 0.001143
H  5.542928 -0.364148 -0.884655
H  5.542358 -0.361715 0.88776
H  1.424029 -2.496452 0.000514
H  -0.329064 2.158706 -0.000379
H  -4.247337 -0.985012 -0.000669
H  -0.664039 -3.841588 -0.000075
H  -2.623737 3.063098 -0.000667
H  6.503041 1.876915 0.850016
H  6.503656 1.874504 -0.852506
