program: Gaussian 09
title: 000245083
version: EM64L-G09RevD.01
frameworkgroup: C1[X(C19H29N3O)]
method: RPBEPBE
basis: SDD
operation: Freq
keyword: #p
keyword: freq=noraman
keyword: PBEPBE/SDD
title: #p freq=noraman PBEPBE/SDD
converged: NO YES NO NO
title: Mulliken charges:
elementType: O N N N C C C C C C C C C C C C C C C C C C C H H H H H H H H H H H H H H H H H H H H H H H H H H H H H
charge: -0.266877 -0.298214 -0.405258 -0.063137 -0.385678 -0.350733 -0.372857 -0.024146 -0.443503 -0.355536 -0.378962 -0.714240 -0.687960 0.390130 -0.245130 0.549493 -0.548366 0.352096 -0.617976 -0.342722 -0.183173 -0.391581 -0.535769 0.216325 0.181248 0.187485 0.189271 0.173328 0.204424 0.192639 0.212893 0.210687 0.230991 0.206681 0.207814 0.184427 0.192649 0.222194 0.214673 0.201538 0.340853 0.201101 0.242508 0.206823 0.258259 0.253567 0.243957 0.224085 0.237339 0.244263 0.218941 0.219139
chargesum: 0.00000
title: Mulliken charges with hydrogens summed into heavy atoms:
elementType: O N N N C C C C C C C C C C C C C C C C C C C
charge: -0.266877 -0.067223 -0.064405 -0.063137 0.011895 0.026023 0.004895 0.168493 -0.019923 0.058958 -0.001887 -0.075835 -0.037528 0.390130 -0.245130 0.549493 -0.290107 0.352096 -0.364409 -0.098765 0.040912 -0.154243 0.146573
polarizability: 3.13967653e+02 1.46956747e+01 2.89029543e+02 -1.25825995e-01 5.48348254e+00 1.42381734e+02
1716.lowfreq: -1.6377 -0.0011 -0.0004 0.0012 3.4640 5.6022 16.3815 18.0498 24.6734
frequency: 16.3067 17.7496 24.6458 41.0254 57.6132 63.8237 68.7829 85.2513 105.7268 108.6828 122.8232 126.6496 133.9119 140.8060 159.4581 185.0044 200.3074 203.9887 208.0519 211.7407 252.8513 254.9812 272.7731 313.0320 313.4773 355.1332 383.9131 395.6609 435.1286 438.7311 457.2808 486.5966 496.8201 510.8958 533.4696 595.0602 609.5809 621.5715 632.6896 634.9585 648.0956 661.2678 732.5913 765.6077 769.1628 776.4080 783.5198 794.2391 816.8283 821.5919 848.0754 858.6325 871.5290 899.6500 921.5064 935.4952 955.8442 968.4435 981.5586 987.9244 1007.9486 1018.7573 1021.4403 1030.3040 1040.1185 1064.2916 1080.0511 1082.6480 1098.3433 1108.1797 1110.1656 1122.3962 1127.6908 1147.5346 1159.5700 1163.2336 1173.6249 1179.0681 1196.3417 1223.3253 1232.0299 1233.8114 1237.8460 1263.2560 1275.3464 1282.4188 1287.4201 1290.7209 1292.0397 1309.4751 1330.6136 1339.4071 1348.1365 1350.5462 1367.5012 1370.2478 1376.0867 1378.9143 1383.9156 1412.2337 1423.4073 1440.7947 1445.3183 1456.6745 1460.9713 1464.5143 1467.1683 1467.4684 1469.3968 1469.5725 1472.5785 1476.0961 1477.4578 1479.5523 1490.5599 1491.5052 1498.5437 1523.6384 1575.0116 1593.9706 1625.8050 2847.6327 2914.0030 2948.8409 2955.1918 2955.5199 2957.5767 2961.9048 2964.4614 2971.0452 2972.3065 2976.7286 2993.0828 2998.6108 3019.9212 3030.6789 3045.0582 3048.4084 3060.1871 3067.7461 3068.1343 3089.6908 3120.0932 3124.6168 3132.8012 3161.8576 3163.7890 3170.1569 3411.3104 3469.9319
redmass: 4.2047 3.0214 4.4188 3.6797 1.6975 3.8502 3.3015 3.3461 1.7691 2.5475 4.1925 3.5167 2.5775 2.6347 2.3360 4.1311 1.8806 1.8183 1.8665 1.3392 1.9391 1.7155 3.1757 4.1336 3.6273 3.6571 3.3378 3.7444 4.3523 3.5466 2.4187 2.9208 3.0924 4.8518 3.7962 5.0403 1.5775 5.8717 2.1485 4.7738 1.7308 1.9295 1.0703 1.1330 5.5382 1.2275 1.2695 2.4954 1.7684 1.7176 1.2595 2.2249 6.3836 1.8575 1.4750 6.1611 1.2730 1.2032 1.3643 1.6516 4.1795 3.9182 3.5072 3.3745 2.3320 3.4189 2.1620 1.9642 2.2931 2.5301 1.2576 1.8018 2.5278 1.5391 1.4843 1.6519 2.1808 2.0452 1.8475 1.9056 1.3756 1.3499 1.5206 1.3135 1.1658 1.2659 1.2711 1.2215 1.1629 1.6957 1.3689 1.5558 1.6153 1.8505 1.7582 1.2644 1.3379 1.9299 1.2812 2.9046 1.7464 1.1743 2.2398 2.1727 1.0681 1.0695 1.1013 1.0513 1.8019 1.1740 1.0732 1.3668 1.0790 1.0933 1.0574 1.0906 1.1027 3.3532 5.4178 6.3412 6.6301 1.0707 1.0566 1.1027 1.0644 1.0611 1.0330 1.0641 1.0399 1.0746 1.0597 1.0371 1.0840 1.0982 1.0974 1.1024 1.1039 1.1033 1.0991 1.0994 1.0992 1.0995 1.0992 1.0871 1.0915 1.0930 1.0983 1.0899 1.0736 1.0764
irintensity: 0.1450 0.1567 0.0287 0.0507 0.7587 0.0155 4.3896 2.5795 1.1702 1.9339 2.1041 1.9216 0.9128 1.4918 1.5828 0.0466 0.5006 3.4223 0.5995 1.9684 1.1632 0.0044 0.2078 1.8672 3.1374 4.1978 2.1488 0.8622 7.3963 2.7376 2.9626 6.8684 0.7136 13.7797 0.2602 4.8275 21.3403 1.3875 52.6442 3.3604 92.7787 14.2962 12.4776 1.8899 5.6890 10.8865 21.9284 23.6248 0.6647 3.4663 3.2698 80.3505 9.9784 1.0770 3.4223 12.0298 6.1507 11.2523 1.4697 12.2647 22.9631 3.1967 30.4157 1.4997 6.6409 7.8579 0.0158 5.4432 5.0216 24.1778 0.2652 39.2246 49.3650 25.8115 4.6676 110.1629 31.4478 20.1456 4.8772 19.0101 15.8007 8.6733 41.5914 0.1455 1.2086 2.0190 3.7300 2.1316 2.7940 19.5756 13.1010 6.2507 23.6898 4.2371 9.8267 23.4293 9.7051 4.0985 13.4615 53.0834 108.3445 33.9600 1.0348 42.5887 2.4535 1.8850 10.8695 12.7577 34.1518 26.8521 1.3894 73.4904 18.3771 3.5890 11.2226 18.6224 56.1916 130.9029 224.4440 158.4749 280.3860 98.6245 63.1346 32.0267 8.8004 6.4634 75.2284 17.2983 27.1806 60.2923 60.0135 34.8770 37.2016 1.2728 31.1375 3.4614 44.2639 131.2820 40.9930 76.8703 46.6390 41.9851 30.1390 4.8396 20.3991 8.5508 37.4768 11.3648 2.1686 51.0045
temp: 298.150 k
press: 1.00000 atm
elementType: 8 7 7 7 6 6 6 6 6 6 6 6 6 6 6 6 6 6 6 6 6 6 6 1 1 1 1 1 1 1 1 1 1 1 1 1 1 1 1 1 1 1 1 1 1 1 1 1 1 1 1 1
symmnumber: 1
zpe: 1175111.0 jmol-1
zpe.correction: 0.447576 hartree
zpe.thermalcorrener: 0.472631 hartree
zpe.thermalcorrenthalpy: 0.473575 hartree
zpe.thermalcorrgfe: 0.389399 hartree
zpe.sumelectzpe: -979.125857 hartree
zpe.sumelectthermal: -979.100802 hartree
zpe.sumelectthermalent: -979.099858 hartree
zpe.sumelectthermalfe: -979.184034 hartree
dipole: 2.4710 1.8173 -0.6753
dipole: 3.1407
quadrupole: -143.3426 -128.7002 -144.0932
quadrupole: 8.1311 -4.2441 3.0328
quadrupole: -4.6306 10.0118 -5.3812 8.1311 -4.2441 3.0328
hfenergy: -979.5734334 hartree
pointgroup: C01 [X(C19H29N3O1)]
dipole: -0.9925108 -0.6585727 -0.3287444 debye
polarizability: 314.8628799|13.7770368|287.9975097|2.2160808|6.9371481|142.5185404 unknown
InChI: InChI=1S/C19H29N3O/c1-4-15(2)20-10-6-5-7-11-21-18-14-17(23-3)13-16-9-8-12-22-19(16)18/h8-9,12-15,20-21H,4-7,10-11H2,1-3H3
charge 0 multiplicity 1
52 atoms
O  4.646754 -3.259375 0.001866
N  -6.287504 0.410169 -0.230931
N  1.241095 0.330536 -0.003406
N  3.214954 2.172542 0.068091
C  -3.801752 0.385517 -0.137597
C  -2.522702 -0.479221 -0.084521
C  -5.094654 -0.455887 -0.134378
C  -7.6112 -0.23484 -0.029319
C  -1.230274 0.365459 -0.066444
C  0.042381 -0.503309 -0.036219
C  -8.697631 0.860361 0.117505
C  -7.996957 -1.250059 -1.142331
C  -8.508842 1.746081 1.366001
C  2.532365 -0.14631 0.014432
C  3.596199 0.845285 0.052323
C  4.974766 0.412286 0.071824
C  2.869372 -1.517972 -0.00188
C  4.242723 -1.912335 0.017582
C  5.288075 -0.976665 0.053826
C  5.966834 1.451088 0.109386
C  5.574318 2.7919 0.12525
C  4.180242 3.11371 0.103585
C  3.612572 -4.293426 -0.036481
H  -3.832211 1.0810 0.723127
H  -3.77811 1.016086 -1.05191
H  -2.503536 -1.163579 -0.958417
H  -2.553318 -1.124393 0.818232
H  -5.025407 -1.221446 -0.948956
H  -5.163507 -1.017655 0.819165
H  -7.545962 -0.78359 0.934112
H  -1.237675 1.032757 0.819107
H  -1.202897 1.019661 -0.961505
H  -6.277694 0.975707 -1.093292
H  0.05796 -1.165062 -0.931032
H  0.011976 -1.172006 0.85327
H  -8.688036 1.491538 -0.79701
H  -9.691537 0.371083 0.145479
H  -7.217803 -2.023278 -1.274126
H  -8.945532 -1.765309 -0.899564
H  -8.131788 -0.73059 -2.111524
H  1.169999 1.354517 0.015807
H  -8.627069 1.152151 2.292337
H  -7.493613 2.179169 1.371223
H  -9.247444 2.568463 1.394713
H  2.076216 -2.268848 -0.029231
H  6.323992 -1.327008 0.067999
H  7.028009 1.176708 0.125445
H  6.314239 3.598245 0.154022
H  3.848093 4.158148 0.115747
H  4.16283 -5.246126 -0.04261
H  2.994772 -4.216615 -0.952584
H  2.959418 -4.248659 0.856913
