program: Gaussian 09
title: 000245080
version: EM64L-G09RevD.01
frameworkgroup: C1[X(C19H24ClN3O)]
method: RPBEPBE
basis: SDD
operation: Freq
keyword: #p
keyword: freq=noraman
keyword: PBEPBE/SDD
title: #p freq=noraman PBEPBE/SDD
converged: YES YES NO NO
title: Mulliken charges:
elementType: Cl O N N N C C C C C C C C C C C C C C C C C C C H H H H H H H H H H H H H H H H H H H H H H H H
charge: -0.059938 -0.240750 -0.136006 -0.448402 -0.047471 0.086015 -0.491964 -0.490374 -0.053726 -0.491968 -0.447809 -0.331125 -0.341815 -0.332874 -0.335489 0.367636 0.264156 -0.326421 -0.031165 -0.332085 -0.390202 -0.295346 -0.276346 -0.090643 0.179161 0.205648 0.213649 0.218855 0.224787 0.233497 0.209633 0.224398 0.232022 0.201344 0.190095 0.204717 0.225327 0.189561 0.306842 0.191239 0.215108 0.216264 0.190950 0.229669 0.196292 0.233353 0.286648 0.255049
chargesum: 0.00000
title: Mulliken charges with hydrogens summed into heavy atoms:
elementType: Cl O N N N C C C C C C C C C C C C C C C C C C C
charge: -0.059938 -0.240750 -0.136006 -0.141560 -0.047471 0.265176 -0.072668 -0.046732 0.179771 -0.057937 -0.014442 0.063688 0.073074 0.073474 0.071726 0.367636 0.264156 -0.096752 -0.031165 -0.135793 -0.156849 -0.008698 -0.021297 -0.090643
polarizability: 3.02012595e+02 -2.66406095e+01 2.61547494e+02 2.37387195e+01 2.11638300e+01 1.70945543e+02
1716.lowfreq: -17.6577 -3.2381 -0.0021 -0.0004 0.0016 5.0450 14.3519 27.5860 31.9215
frequency: 12.6992 27.3294 31.7306 45.4561 71.2412 80.4748 114.1351 128.1057 143.4173 184.2035 191.4812 212.9248 233.3686 245.0446 252.4692 273.6203 285.3894 317.1571 346.5871 360.5387 375.6316 392.2709 393.6652 411.9538 434.4245 447.8107 457.8721 465.7774 474.8138 500.9236 503.6189 521.7683 576.2522 602.0465 616.2570 636.5722 643.0649 665.5559 742.5184 758.0652 771.4240 778.1486 806.4926 806.7475 820.3876 825.8903 834.7196 841.5197 852.6203 869.9877 896.5228 906.8518 921.1327 930.7412 931.4657 949.4415 964.8954 983.2428 1015.8803 1025.1720 1054.7305 1056.3089 1059.4208 1062.5961 1072.9601 1091.9163 1096.2230 1101.3052 1107.4747 1120.4536 1140.1073 1147.7714 1150.9244 1170.7323 1191.4573 1205.1081 1211.4991 1235.6317 1242.5150 1255.3494 1263.9473 1268.4353 1289.3460 1293.6529 1298.2749 1310.6682 1319.2285 1324.3023 1333.3535 1335.5666 1339.9389 1348.9339 1353.2850 1356.1136 1368.8730 1372.0803 1380.1085 1380.4690 1390.8337 1416.2468 1440.3653 1443.9784 1449.7022 1452.0805 1457.1687 1463.0853 1466.2645 1469.4574 1471.5003 1483.4609 1529.8577 1557.9074 1581.9678 1609.6232 2803.7263 2858.4819 2868.4966 2951.0397 2954.9832 2973.6881 2974.3372 2982.2202 2985.2447 2996.8075 3040.7064 3045.9833 3047.9802 3052.9668 3056.2495 3062.0569 3078.5107 3081.8776 3115.5522 3116.6168 3173.0683 3173.6708 3181.9932 3574.3864
redmass: 6.9659 5.1201 3.1589 4.5048 5.0253 4.1662 4.9245 3.9547 4.3519 3.8540 3.5494 3.5939 1.8834 4.6286 3.8082 4.8504 3.8436 3.0845 2.5372 2.7711 2.7556 2.0332 2.0336 2.8720 2.1115 2.1981 2.9908 3.3821 3.8811 4.1128 3.2753 5.9723 7.4624 2.3230 5.2806 4.0597 3.9091 2.9237 5.0101 1.8080 3.0718 1.5043 2.9295 2.4779 1.6421 3.2731 4.7144 1.6473 2.7680 4.9159 1.5029 2.6775 1.9806 1.5371 1.3544 1.4116 2.9090 2.7022 2.4768 2.2086 1.9564 2.1964 2.3620 1.8863 2.5966 2.2602 1.6910 2.1401 2.3039 2.7785 2.3155 2.2639 1.8203 1.6701 1.1450 1.5161 1.7364 1.3827 1.4521 1.3141 1.3068 1.2258 1.4026 1.1949 1.2779 1.6075 1.5020 1.7865 1.4379 1.8722 1.4038 1.2756 1.5128 1.4364 1.4574 2.1068 1.3069 1.4865 4.2773 2.6718 2.4604 1.0810 1.0873 1.0954 1.1274 1.2823 1.3741 1.0989 1.1712 1.2005 4.6239 3.8403 6.5431 6.6339 1.0799 1.0712 1.0697 1.0668 1.0669 1.0707 1.0653 1.0658 1.0616 1.0732 1.0953 1.0973 1.0996 1.0994 1.0887 1.0904 1.0956 1.0972 1.0885 1.0899 1.0933 1.0948 1.0933 1.0757
irintensity: 0.5110 1.3926 0.3593 0.1263 0.5415 0.0144 1.2460 0.5214 0.0563 0.8251 0.2551 1.6434 2.0809 1.0016 6.1296 0.6164 2.6110 5.7474 4.0611 4.9533 3.9124 22.3750 0.4622 8.8749 45.1576 6.5428 0.4583 1.9279 8.8319 3.9178 8.5417 2.0838 9.5269 9.1669 0.7143 9.8418 7.6299 9.1657 2.6336 18.4878 23.7410 0.0703 12.8364 44.7075 16.8878 26.5797 31.5049 2.2140 19.6218 47.1546 24.9232 6.8220 13.2817 2.9291 0.0692 1.8045 7.9762 5.0751 33.4107 7.9683 18.2925 1.6615 3.2564 11.3517 13.4812 35.4412 4.4587 1.0352 14.7740 62.8432 14.5054 8.4473 15.3817 2.4004 0.7111 6.8026 11.5475 20.8904 3.7159 30.0224 23.6880 6.1307 12.3922 3.0144 4.2569 5.0573 2.0027 2.5589 5.1857 33.4284 3.5617 6.1199 29.8324 36.9870 1.9231 3.8172 0.7208 35.0861 76.8482 8.2683 51.8728 2.1965 4.5465 17.7005 28.5801 30.4564 39.1548 11.3487 14.8542 14.4371 112.9621 196.5071 364.4368 80.4430 57.9333 45.7972 134.9681 30.0027 98.7501 14.5274 15.6271 18.1073 26.8153 68.1216 26.7348 15.8288 22.4656 118.4355 62.1733 13.4877 44.5222 35.1181 17.5686 30.8322 23.7166 5.7462 0.7966 35.1262
temp: 298.150 k
press: 1.00000 atm
elementType: 17 8 7 7 7 6 6 6 6 6 6 6 6 6 6 6 6 6 6 6 6 6 6 6 1 1 1 1 1 1 1 1 1 1 1 1 1 1 1 1 1 1 1 1 1 1 1 1
symmnumber: 1
zpe: 1049464.3 jmol-1
zpe.correction: 0.399720 hartree
zpe.thermalcorrener: 0.421049 hartree
zpe.thermalcorrenthalpy: 0.421993 hartree
zpe.thermalcorrgfe: 0.347430 hartree
zpe.sumelectzpe: -1436.155206 hartree
zpe.sumelectthermal: -1436.133877 hartree
zpe.sumelectthermalent: -1436.132932 hartree
zpe.sumelectthermalfe: -1436.207495 hartree
dipole: 5.4576 -2.4077 2.2404
dipole: 6.3720
quadrupole: -195.2749 -148.3922 -146.2721
quadrupole: -9.6215 2.1311 2.1546
quadrupole: -31.9618 14.9209 17.0409 -9.6215 2.1311 2.1546
hfenergy: -1436.5549259 hartree
pointgroup: C01 [X(C19H24Cl1N3O1)]
dipole: -2.0643418 -1.0553075 -0.9536869 debye
polarizability: 297.4646846|28.0506001|267.5041338|27.6778888|-13.9849253|169.536814 unknown
InChI: InChI=1S/C19H24ClN3O/c20-14-1-6-17-18(7-8-21-19(17)13-14)22-15-2-4-16(5-3-15)23-9-11-24-12-10-23/h1,6-8,13,15-16,22H,2-5,9-12H2
charge 0 multiplicity 1
48 atoms
Cl 5.717862 3.656306 0.139915
O  -6.357088 1.841083 0.754215
N  -3.909936 0.375526 0.056736
N  0.628431 -0.984319 -0.754451
N  4.527635 -1.320295 1.006256
C  -3.069694 -0.822301 -0.277375
C  -2.31306 -0.580124 -1.611937
C  -2.047251 -1.146337 0.841471
C  -0.356152 -2.079266 -0.864324
C  -1.371899 -1.751805 -1.982262
C  -1.117972 -2.324269 0.466692
C  -5.029256 0.56348 -0.911793
C  -4.469718 0.366419 1.438815
C  -5.805774 1.854353 -0.608101
C  -5.254011 1.661138 1.709103
C  1.877992 -1.091517 -0.172937
C  2.765588 0.064458 -0.115183
C  2.36123 -2.303787 0.374523
C  4.073299 -0.113593 0.483734
C  2.413658 1.35741 -0.615816
C  3.6664 -2.35769 0.933236
C  4.97095 1.001708 0.553827
C  3.297634 2.438694 -0.540778
C  4.575772 2.235291 0.050058
H  -3.724611 -1.72769 -0.408521
H  -1.758907 0.376141 -1.510619
H  -3.021887 -0.435608 -2.446873
H  -2.567256 -1.409672 1.779832
H  -1.442899 -0.239959 1.046661
H  0.191751 -3.001078 -1.144916
H  -1.980179 -2.658883 -2.16528
H  -0.837074 -1.529239 -2.925439
H  -0.398194 -2.498503 1.287724
H  -1.714788 -3.252916 0.357224
H  -5.736875 -0.30421 -0.880663
H  -4.628837 0.63699 -1.937632
H  -3.648511 0.312596 2.173176
H  -5.14386 -0.512326 1.604191
H  0.340821 -0.078501 -1.121104
H  -5.132451 2.730458 -0.732115
H  -6.674549 1.957419 -1.279325
H  -5.725647 1.632106 2.705363
H  -4.561916 2.529356 1.649324
H  1.752569 -3.210853 0.37628
H  1.434337 1.542215 -1.073642
H  4.028327 -3.306994 1.34776
H  5.950634 0.837356 1.009095
H  3.019264 3.423728 -0.925021
