program: Gaussian 09
title: 000245056
version: EM64L-G09RevD.01
frameworkgroup: C1[X(C11H14O)]
method: RPBEPBE
basis: SDD
operation: Freq
keyword: #pfreq=noraman
keyword: PBEPBE/SDD
title: #p freq=noraman PBEPBE/SDD
converged: YES YES NO NO
title: Mulliken charges:
elementType: O C C C C C C C C C C C H H H H H H H H H H H H H H
charge: -0.457412 -0.022650 -0.463997 -0.566384 -0.553557 0.290754 0.282956 -0.407687 -0.396032 -0.394995 -0.250698 -0.249816 0.236169 0.208594 0.200698 0.258024 0.203485 0.221443 0.221454 0.199379 0.186027 0.233418 0.228376 0.223988 0.223958 0.344502
chargesum: 0.00000
title: Mulliken charges with hydrogens summed into heavy atoms:
elementType: O C C C C C C C C C C C
charge: -0.112910 0.213519 -0.054706 -0.104875 -0.110659 0.290754 0.282956 -0.022280 -0.162613 -0.166619 -0.026709 -0.025858
polarizability: 1.51825942e+02 -2.28190181e+00 1.23154685e+02 -4.23284726e+00 -3.32668046e+00 7.00301663e+01
1716.lowfreq: -14.7777 -0.0003 0.0002 0.0004 5.8019 10.9446 65.8614 88.2404 138.9955
frequency: 65.8061 88.2250 138.9909 165.0304 212.8089 255.0886 267.7314 305.9741 362.5591 422.3226 440.9986 454.5812 466.6888 505.5518 580.1059 615.5585 708.9031 723.8003 749.5453 809.7412 842.8839 870.0712 889.2347 911.2083 946.2247 956.2226 964.5145 984.1741 1025.9376 1038.1984 1053.9882 1080.6693 1114.1335 1123.2506 1139.1764 1172.1144 1185.3126 1194.4565 1195.5328 1218.8333 1240.6764 1253.1135 1275.2735 1302.3838 1309.9925 1337.8074 1353.4217 1373.1282 1381.6653 1410.0207 1439.6160 1453.0183 1457.6547 1469.1110 1477.8876 1489.9427 1590.3595 1613.8736 2919.7354 2943.3163 2958.1098 2965.8543 2970.1744 2993.4490 3017.1405 3032.0153 3050.4020 3106.6154 3112.1134 3133.1248 3155.9788 3573.1681
redmass: 3.7098 3.5810 2.9274 3.3712 2.0115 2.3872 1.1636 4.0289 3.7628 2.1276 2.4807 3.5404 3.8874 3.5037 3.8545 3.7626 3.2390 4.1310 1.2253 2.0351 2.6604 1.5310 1.6049 1.8633 1.7719 1.5080 4.3868 1.3200 2.6473 2.2468 2.2047 1.9150 1.7176 1.9813 1.2071 1.0618 1.2073 1.5728 1.5513 1.8941 1.3727 1.4006 1.3568 1.2658 1.4407 1.4820 1.5111 1.8207 3.8876 1.4646 2.3903 1.1630 1.0834 1.0876 1.0969 2.2316 6.5459 6.4416 1.0550 1.0692 1.0636 1.0797 1.0806 1.0896 1.0949 1.1020 1.0917 1.0866 1.0887 1.0926 1.1005 1.0666
irintensity: 0.3477 4.5327 1.3452 4.9543 15.0118 4.6496 143.3251 1.5658 1.6637 5.0897 4.9259 1.6977 13.0069 0.8721 0.3326 1.5634 0.4333 0.5478 70.4098 9.8312 5.7250 3.8938 5.0539 5.8238 1.3684 11.7947 46.8672 0.0378 8.6797 1.7105 47.6813 2.7727 1.0208 2.9864 2.7227 0.1216 6.1840 3.3786 0.3036 2.4877 13.1486 12.4454 5.1379 7.6906 3.1915 2.1290 0.1516 0.4061 1.2387 2.1220 5.7615 2.4358 18.9263 2.4036 17.2344 19.0066 3.3221 0.9551 63.8239 21.1346 28.2656 13.9573 66.0952 44.6515 41.0209 74.9577 19.7453 16.6133 2.8617 32.1370 37.0104 2.1423
temp: 298.150 k
press: 1.00000 atm
elementType: 8 6 6 6 6 6 6 6 6 6 6 6 1 1 1 1 1 1 1 1 1 1 1 1 1 1
symmnumber: 1
zpe: 582619.0 jmol-1
zpe.correction: 0.221908 hartree
zpe.thermalcorrener: 0.232644 hartree
zpe.thermalcorrenthalpy: 0.233588 hartree
zpe.thermalcorrgfe: 0.185611 hartree
zpe.sumelectzpe: -501.894242 hartree
zpe.sumelectthermal: -501.883505 hartree
zpe.sumelectthermalent: -501.882561 hartree
zpe.sumelectthermalfe: -501.930539 hartree
dipole: -1.8358 1.1935 0.9867
dipole: 2.4017
quadrupole: -59.1821 -68.2473 -75.8001
quadrupole: -0.8817 -3.9399 -2.3212
quadrupole: 8.5611 -0.5042 -8.0569 -0.8817 -3.9399 -2.3212
hfenergy: -502.1161496 hartree
pointgroup: C01 [X(C11H14O1)]
dipole: -0.7298717 -0.4559816 -0.3900966 debye
dipolederiv: -0.3768954 0.164253 0.2098413 0.2544021 -0.713 -0.0367682 0.2778873 -0.0553304 -0.5154806 -0.0195821 0.0599001 -0.0027961 0.0642017 0.0095674 -0.0073252 -0.079131 -0.0116823 0.1123102 0.0248826 0.0711272 -0.027431 0.0305579 0.0432517 -0.0217508 -0.0056484 0.008687 0.1488399 -0.0570687 -0.0117861 -0.0095686 0.0676857 0.0239419 0.0140805 -0.0725431 0.015772 0.1551397 0.0596044 -0.0215772 -0.0157691 -0.0467918 0.0433918 0.0162996 0.0521681 0.0598096 0.163912 0.2796242 -0.086202 0.054688 -0.2153681 -0.108087 0.0048947 0.1504324 0.0119222 -0.0322837 -0.0254035 0.1569281 -0.0408859 0.2784291 0.1374369 -0.0106094 -0.1241597 -0.0570652 -0.0610569 0.3986273 -0.1545037 -0.1292088 -0.1814696 0.5730623 0.0714017 -0.1159798 0.060118 0.4212824 -0.1416603 -0.0092808 0.0022352 -0.0412405 0.1097105 -0.0405585 0.0047679 -0.0314998 -0.159849 -0.0641178 -0.1110731 0.0257596 -0.0873283 0.0612007 -0.0375263 0.0250772 -0.0349524 -0.1605327 -0.0247845 0.0434592 0.010441 0.0786119 0.0366922 -0.0086535 -0.0014959 -0.014161 -0.1684146 0.0470788 -0.0262169 0.0092 -0.0642391 -0.0503822 -0.0146783 0.0229815 -0.0085314 -0.1690146 0.0608345 0.0077952 -0.0299983 -0.0347551 0.0370005 0.0244968 0.0040427 0.0169868 -0.1544976 0.0593898 0.02133 -0.0010604 0.0439734 0.0623916 0.054843 -0.0252814 -0.020531 -0.1768127 -0.0952813 -0.1652719 0.0193892 -0.147303 -0.0921382 0.0178979 0.0457575 0.0424509 0.0648115 0.0621141 -0.0039602 0.002792 0.0223527 -0.0771905 -0.0637851 0.0235785 -0.0766949 0.0583708 -0.0436071 0.0206481 -0.0643048 -0.0105615 0.0744778 0.0148726 -0.0706615 0.0665392 -0.135535 -0.0368541 0.0890218 0.0416139 0.0469929 -0.1070258 -0.0711912 0.0140646 -0.1146471 0.0424446 -0.0022714 -0.0751939 0.023486 -0.0544829 0.0239141 0.0464597 0.0112922 0.1005409 -0.1276413 -0.0998727 -0.0991845 0.0455092 -0.1122603 -0.1741413 0.0130463 0.0849078 0.0419079 0.0244188 0.044644 0.0207538 0.0234494 0.053754 -0.0149853 -0.0015086 -0.0287913 -0.0439916 -0.2425504 0.0596601 0.0895281 -0.0137641 0.0508965 -0.1021629 0.027711 -0.0076681 0.0260415 0.1389135 0.0656514 0.037195 -0.009824 0.0795825 -0.1225302 0.0318315 -0.014108 0.0244574 0.1391562 -0.0338059 -0.1133283 -0.0008586 -0.1242052 -0.0417083 0.01043 -0.0012367 0.0110092 0.1580167 -0.1498053 0.0360954 -0.0239681 0.0434308 0.0757194 0.0099555 -0.0241524 0.0095064 0.1571584 0.0088986 0.0595433 -0.0989669 0.0051341 0.2915928 -0.0438657 -0.1461006 -0.0266619 0.3188943 unknown
polarizability: 151.8742476|1.7430242|123.0684372|4.4431128|-3.4693814|70.0681092 unknown
InChI: InChI=1S/C11H14O/c12-8-9-5-6-10-3-1-2-4-11(10)7-9/h1-4,9,12H,5-8H2
charge 0 multiplicity 1
26 atoms
O  -3.740272 1.31659 0.449812
C  -1.902633 -0.245449 0.190542
C  -1.42844 -1.594954 -0.397145
C  -0.958168 0.883739 -0.278321
C  -0.028042 -1.954832 0.144857
C  0.520772 0.54584 -0.109633
C  0.964518 -0.796544 0.058474
C  -3.357402 0.046062 -0.192761
C  1.482805 1.588003 -0.145923
C  2.354119 -1.055903 0.175878
C  2.862781 1.3218 -0.026745
C  3.30314 -0.013236 0.134171
H  -1.856953 -0.311902 1.297406
H  -1.394889 -1.519589 -1.503692
H  -2.142852 -2.403844 -0.145513
H  -1.204078 1.818009 0.256731
H  -1.161544 1.084271 -1.353255
H  0.377327 -2.832594 -0.394666
H  -0.124698 -2.263703 1.206954
H  -4.011758 -0.781436 0.159135
H  -3.448175 0.122147 -1.300151
H  1.137467 2.622724 -0.268214
H  2.692942 -2.092716 0.301634
H  3.587158 2.143618 -0.057234
H  4.372182 -0.236378 0.2258
H  -4.676908 1.53528 0.216856
