program: Gaussian 09
title: 000245068
version: EM64L-G09RevD.01
frameworkgroup: C1[X(C19H29N3O)]
method: RPBEPBE
basis: SDD
operation: Freq
keyword: #p
keyword: freq=noraman
keyword: PBEPBE/SDD
title: #p freq=noraman PBEPBE/SDD
converged: YES YES NO NO
title: Mulliken charges:
elementType: O N N N C C C C C C C C C C C C C C C C C C C H H H H H H H H H H H H H H H H H H H H H H H H H H H H H
charge: -0.261095 -0.104628 -0.438112 -0.047584 -0.457711 -0.013054 -0.377397 -0.350602 -0.710835 -0.321946 -0.322003 0.389373 0.266984 -0.673806 -0.676396 -0.349314 -0.013150 -0.351022 -0.393724 -0.472683 -0.407994 0.346157 -0.536793 0.187337 0.209413 0.210797 0.207283 0.219844 0.176422 0.199682 0.291240 0.210053 0.245088 0.214609 0.204051 0.183555 0.203131 0.184163 0.206458 0.229896 0.206953 0.207101 0.231078 0.205870 0.226058 0.185814 0.228575 0.281688 0.237756 0.218184 0.218169 0.247070
chargesum: 0.00000
title: Mulliken charges with hydrogens summed into heavy atoms:
elementType: O N N N C C C C C C C C C C C C C C C C C C C
charge: -0.261095 -0.104628 -0.146873 -0.047584 -0.060961 0.197743 0.049730 0.025501 -0.041085 0.065660 0.065291 0.389373 0.266984 -0.030500 -0.032346 -0.123256 -0.013150 -0.165209 -0.165149 -0.190995 -0.170238 0.346157 0.146630
polarizability: 2.86092230e+02 4.73957040e+01 2.66227062e+02 2.12471623e+01 -2.87367912e+01 1.84393556e+02
1716.lowfreq: -12.0315 -5.2691 -2.3015 -0.0003 0.0005 0.0006 13.7925 20.5453 22.9763
frequency: 13.5915 20.0408 22.0886 44.5652 58.8623 63.4395 76.4455 81.0760 93.5261 102.3841 122.9939 141.5371 149.7715 177.9813 194.5013 196.6716 219.7496 222.1320 226.6616 236.4938 250.4891 286.2490 291.6025 304.2812 315.1358 339.4044 352.4494 369.8292 410.8176 418.1010 435.0724 446.0161 479.4452 491.5051 514.9290 520.2769 521.2851 549.2564 604.2567 629.7967 657.0057 693.4289 734.7713 743.7190 750.0179 759.9726 794.5133 797.2181 799.8335 813.7303 816.8323 851.1291 869.9830 893.8024 900.7349 912.9486 916.6731 939.4762 945.2067 982.7436 992.3939 1002.1529 1021.8819 1048.8911 1056.3879 1074.3374 1078.4506 1083.3835 1085.8528 1096.3400 1103.6818 1110.0347 1138.8319 1142.3915 1145.1166 1159.8387 1177.0699 1191.5765 1204.9890 1218.7120 1230.7875 1255.6268 1263.1968 1274.4904 1281.0725 1290.4934 1294.2214 1310.9934 1316.9342 1332.2034 1343.0625 1350.2015 1361.5117 1365.9490 1367.3381 1379.0078 1386.2517 1387.0635 1387.4923 1391.6538 1428.1823 1433.8431 1452.3545 1459.9510 1460.3339 1462.2102 1465.6939 1467.5045 1470.4709 1473.1182 1473.6937 1477.0293 1478.9003 1483.8283 1486.1554 1489.6721 1491.0115 1531.3176 1560.3616 1583.1609 1631.1791 2826.9291 2841.6170 2855.3169 2945.6840 2956.4428 2978.9336 2981.8727 2982.5385 2983.7365 2990.0605 3017.1014 3023.7140 3028.6214 3035.8230 3043.5275 3056.1718 3074.1591 3075.9648 3077.0245 3087.1868 3092.2370 3093.5636 3103.9401 3110.0771 3122.7092 3162.9978 3168.3936 3181.8694 3562.1295
redmass: 4.5100 4.3647 3.3223 3.7215 2.5715 3.3869 3.0606 2.0409 3.2839 2.5712 2.6932 2.7919 2.7751 1.7048 2.0987 1.8397 1.2158 1.4576 1.3357 2.4260 3.0637 2.3250 2.0827 2.6615 3.4628 4.2241 2.3821 1.7403 2.9289 3.3741 2.4900 3.1764 3.1273 3.2411 2.9653 3.4086 4.2515 4.6027 6.1278 5.3561 3.1377 6.0859 1.9454 1.5927 3.1130 1.7576 1.1450 1.2268 2.2309 1.7720 2.0138 1.8722 2.5151 1.6213 4.3956 1.3622 1.9053 1.9851 1.4139 2.0768 2.3453 2.2941 3.3638 2.3631 2.3257 1.9023 2.4322 2.0050 2.2374 2.2573 2.6282 1.2574 1.7661 1.6189 1.8427 1.6376 1.7962 1.8551 2.2809 1.7227 2.1823 1.3051 1.9741 1.2233 1.1308 1.2187 1.1932 1.5046 1.6534 1.4989 2.2589 1.5475 1.3313 1.3560 2.5672 1.4239 1.2297 1.2304 1.2342 2.7734 2.3313 1.4645 2.3728 1.1053 1.1142 1.0604 1.2113 1.0508 1.0596 1.0848 1.0741 1.0623 1.0596 1.3296 1.1680 1.1399 1.0803 4.7382 3.9394 5.7822 6.8301 1.0716 1.0724 1.0713 1.0662 1.0332 1.0448 1.0716 1.0358 1.0358 1.0622 1.0912 1.0885 1.0871 1.0871 1.1039 1.1019 1.0984 1.0979 1.0999 1.0998 1.1003 1.1003 1.0879 1.0896 1.0990 1.0933 1.0931 1.0923 1.0757
irintensity: 0.0803 2.4634 0.1501 0.2253 1.1938 0.4054 3.1839 0.2115 0.5405 0.1881 0.0833 1.2082 1.3481 1.1667 0.0544 0.1549 0.2020 0.3470 0.8573 1.3521 0.1528 4.4814 2.4587 0.9347 9.8188 4.8766 23.1103 43.1577 4.7384 12.6598 38.9267 5.4125 7.7884 2.0732 0.8504 9.8292 3.8580 8.6754 4.1152 1.8502 8.3665 6.4199 8.4455 8.1107 4.3762 19.2660 4.0416 1.8514 44.8952 19.4592 11.9397 7.2910 8.6320 32.4015 2.4868 0.7554 0.7926 7.4741 1.6847 7.1830 18.9051 40.1667 7.7650 2.7277 2.8252 17.8428 14.2118 57.2246 14.8221 12.8879 12.6667 0.2308 21.7267 58.2549 14.0530 66.5362 38.2832 1.9803 26.1903 24.9306 84.9937 20.5632 84.5217 8.6166 2.0072 17.7073 17.4478 5.2862 4.6777 1.4640 91.0267 11.0214 5.4729 6.8108 4.0639 3.5081 38.8714 25.1272 16.0541 84.7895 10.7500 28.0231 22.8026 14.4745 28.1635 11.2590 64.3894 12.9446 1.9017 20.4612 23.9043 11.1784 7.0435 42.1598 33.3270 1.9398 17.1179 70.7128 301.7620 215.7532 182.0215 54.6300 32.3298 229.6637 24.8763 79.5961 21.5237 24.5430 34.2248 28.3079 31.3872 24.2992 1.8142 19.2648 16.3881 51.8925 64.0178 39.2988 83.8789 50.6379 36.5936 34.0453 45.7349 24.3139 35.2118 26.6503 15.0750 25.6209 1.9214 17.5468
temp: 298.150 k
press: 1.00000 atm
elementType: 8 7 7 7 6 6 6 6 6 6 6 6 6 6 6 6 6 6 6 6 6 6 6 1 1 1 1 1 1 1 1 1 1 1 1 1 1 1 1 1 1 1 1 1 1 1 1 1 1 1 1 1
symmnumber: 1
zpe: 1172284.3 jmol-1
zpe.correction: 0.446500 hartree
zpe.thermalcorrener: 0.471613 hartree
zpe.thermalcorrenthalpy: 0.472557 hartree
zpe.thermalcorrgfe: 0.388927 hartree
zpe.sumelectzpe: -979.110062 hartree
zpe.sumelectthermal: -979.084948 hartree
zpe.sumelectthermalent: -979.084004 hartree
zpe.sumelectthermalfe: -979.167634 hartree
dipole: -5.1060 1.8907 -4.6180
dipole: 7.1394
quadrupole: -154.5634 -125.0194 -142.9780
quadrupole: 15.6677 -9.2629 -4.7162
quadrupole: -13.7098 15.8342 -2.1244 15.6677 -9.2629 -4.7162
hfenergy: -979.5565617 hartree
pointgroup: C01 [X(C19H29N3O1)]
dipole: 2.0317125 0.7636122 1.7829173 debye
polarizability: 284.4209568|-46.8826125|269.9007575|22.9003676|25.6978028|182.3911339 unknown
InChI: InChI=1S/C19H29N3O/c1-5-22(6-2)13-7-8-15(3)21-18-11-12-20-19-14-16(23-4)9-10-17(18)19/h9-12,14-15,21H,5-8,13H2,1-4H3
charge 0 multiplicity 1
52 atoms
O  -5.19719 2.539992 0.094504
N  4.744349 1.084342 -0.227302
N  0.043066 -1.38083 0.730647
N  -3.558729 -1.623597 -1.595234
C  2.440061 -1.710899 1.201319
C  1.12123 -2.391149 0.756974
C  2.979354 -0.671056 0.194705
C  4.236758 0.056903 0.71853
C  0.761103 -3.590339 1.669999
C  6.210058 1.311418 -0.099886
C  3.962331 2.349488 -0.159828
C  -1.121534 -1.467413 -0.014308
C  -2.120474 -0.407882 0.059824
C  7.049773 0.182156 -0.727193
C  4.031212 3.172653 -1.460355
C  -1.392271 -2.552765 -0.878801
C  -3.319702 -0.541016 -0.74788
C  -1.985122 0.755335 0.87469
C  -2.599616 -2.570776 -1.631221
C  -4.315488 0.476147 -0.69366
C  -2.970496 1.748689 0.917583
C  -4.151178 1.602598 0.122528
C  -5.065312 3.738113 0.925053
H  2.27983 -1.2347 2.194285
H  3.19814 -2.502287 1.363284
H  1.258901 -2.757978 -0.280472
H  2.183932 0.062071 -0.04117
H  3.235636 -1.165249 -0.761713
H  4.019105 0.498849 1.727157
H  5.034158 -0.693409 0.877299
H  0.133013 -0.613488 1.396044
H  0.710962 -3.271235 2.727574
H  -0.219639 -4.016529 1.396037
H  1.52219 -4.387928 1.585701
H  6.450977 2.254939 -0.622381
H  6.509533 1.458366 0.970054
H  2.905772 2.08326 0.027335
H  4.286521 2.981306 0.70748
H  6.875342 -0.789743 -0.230486
H  6.791964 0.068826 -1.794428
H  8.128928 0.410318 -0.643379
H  5.063947 3.485818 -1.697931
H  3.654716 2.573868 -2.307541
H  3.416848 4.088226 -1.371435
H  -0.695898 -3.388197 -0.98295
H  -1.092299 0.908537 1.494449
H  -2.793282 -3.419127 -2.300487
H  -5.212092 0.360266 -1.307398
H  -2.826542 2.625482 1.555527
H  -4.996959 3.481919 2.00065
H  -4.184669 4.342045 0.630203
H  -5.984315 4.314162 0.742003
