program: Gaussian 09
title: 000245069
version: EM64L-G09RevD.01
frameworkgroup: C1[X(C19H29N3O)]
method: RPBEPBE
basis: SDD
operation: Freq
keyword: #p
keyword: freq=noraman
keyword: PBEPBE/SDD
title: #p freq=noraman PBEPBE/SDD
converged: YES YES NO NO
title: Mulliken charges:
elementType: O N N N C C C C C C C C C C C C C C C C C C C H H H H H H H H H H H H H H H H H H H H H H H H H H H H H
charge: -0.282080 -0.116278 -0.432694 -0.050971 -0.361573 -0.065923 -0.420392 -0.368691 -0.772030 -0.316658 -0.311916 0.364641 0.316007 -0.677861 -0.675660 -0.331456 -0.174280 -0.399844 0.281377 -0.405549 -0.256880 -0.381418 -0.493063 0.261520 0.184852 0.223766 0.204446 0.207589 0.193584 0.194482 0.301666 0.217547 0.227627 0.233015 0.184784 0.207960 0.183652 0.204716 0.245414 0.201787 0.208605 0.225557 0.205009 0.207074 0.230023 0.187035 0.230086 0.223660 0.251468 0.246413 0.210761 0.229093
chargesum: 0.00000
title: Mulliken charges with hydrogens summed into heavy atoms:
elementType: O N N N C C C C C C C C C C C C C C C C C C C
charge: -0.282080 -0.116278 -0.131029 -0.050971 0.084798 0.157843 -0.008357 0.019376 -0.093841 0.076085 0.076452 0.364641 0.316007 -0.022055 -0.038019 -0.101433 -0.174280 -0.212809 0.281377 -0.175462 -0.033220 -0.129950 0.193205
polarizability: 2.83891729e+02 4.19914510e+01 2.21465260e+02 -2.97157974e+01 2.88121868e+01 2.13037862e+02
1716.lowfreq: -9.9928 -3.8768 -0.0008 -0.0005 -0.0003 5.2743 7.7900 11.8639 24.9741
frequency: 5.0596 10.8461 24.6153 31.2262 39.3779 54.4211 71.0271 78.9446 99.3790 115.1597 127.8437 162.9489 172.5991 185.1684 203.2174 206.7803 210.8144 221.6893 233.0478 236.7803 244.9820 282.9830 290.3668 299.2626 320.8505 343.7897 356.1620 381.2767 409.5312 422.3228 442.9630 459.6661 475.0078 484.6948 513.6736 523.4818 551.8787 570.1690 603.1872 620.1312 682.4340 688.7179 700.7475 733.1637 775.6283 790.0720 792.0474 796.0292 801.4052 807.8643 825.4780 836.1465 859.6957 866.1964 897.2867 915.5255 923.7723 942.2216 954.1652 957.9408 991.9042 993.9981 1023.6295 1038.0153 1073.4309 1076.7040 1081.5921 1083.1229 1085.6116 1091.0319 1108.3209 1113.9310 1123.5755 1138.5438 1153.4938 1166.4037 1185.7498 1199.8793 1201.8073 1215.4089 1224.7252 1244.9047 1256.3434 1279.8331 1283.7370 1295.2187 1295.7649 1307.2312 1326.2251 1339.7063 1346.1755 1357.0494 1362.8436 1363.7782 1375.5960 1378.9826 1386.7857 1388.5567 1389.0513 1391.0653 1407.5308 1431.2334 1443.8389 1453.3707 1457.0618 1458.3765 1460.0973 1462.4623 1470.0423 1471.2393 1473.5409 1477.3527 1478.2034 1480.7819 1482.8052 1487.6697 1490.4397 1541.4904 1559.1462 1588.2650 1605.0641 2844.7105 2847.6116 2861.9566 2959.3956 2972.0576 2976.7184 2979.9952 2981.1904 2982.3739 3000.5262 3012.2152 3029.0389 3033.6942 3035.6534 3050.4793 3071.2679 3073.4665 3075.0745 3089.4546 3090.7743 3091.3786 3109.6065 3110.9172 3113.0062 3126.9819 3145.0501 3171.2219 3177.0051 3573.8752
redmass: 3.0156 4.5609 3.3538 4.2739 4.1961 4.1052 2.7030 2.0183 2.6647 3.1557 2.3950 2.0083 2.6173 3.1941 1.4501 1.6643 1.2800 1.8501 1.8495 2.0501 2.5566 4.0889 1.8236 2.1761 2.1907 3.0866 1.8427 1.9444 2.8811 2.7181 5.3787 2.5331 3.3541 3.6248 4.5265 4.3179 6.5424 5.1402 3.4992 2.8822 4.3319 5.6796 2.2934 1.4626 1.4233 1.4530 3.0474 1.2621 2.2370 3.2714 1.6028 5.3418 2.6199 1.4386 2.4719 1.9886 1.8478 1.4016 1.3319 2.5597 2.2044 1.8456 2.2011 2.2693 1.8686 2.0593 2.6795 2.1218 2.1514 1.8959 1.2424 1.8807 2.0118 1.5897 1.7685 1.7840 1.4183 2.1322 2.4792 1.8684 1.5818 1.5110 2.6242 1.1602 1.1783 1.2343 1.3593 2.0475 1.3616 1.7421 1.9531 1.3906 1.3230 1.3846 3.1094 1.3770 1.2393 1.4123 2.1454 1.2507 2.4103 1.4559 1.0635 1.1332 1.1734 1.3733 1.0669 1.0586 1.0662 1.8088 1.0728 1.1433 1.0599 1.0599 1.1311 1.0683 1.0786 4.0609 4.6957 6.6199 6.1796 1.0721 1.0720 1.0711 1.0782 1.0593 1.0679 1.0382 1.0362 1.0360 1.0285 1.0919 1.0905 1.0882 1.0875 1.1000 1.0986 1.0984 1.0979 1.1003 1.1003 1.0993 1.1016 1.0933 1.0866 1.1044 1.0920 1.0965 1.0932 1.0756
irintensity: 5.0683 0.0756 0.4671 2.1275 0.3366 2.1067 0.0695 0.2058 0.2086 0.2808 0.0874 1.1869 1.3509 1.2188 1.7081 1.3376 0.2285 1.3541 0.3178 0.8011 2.3512 0.7867 1.6443 0.4947 4.8399 6.9234 15.0351 67.7216 7.9646 5.4938 2.5656 3.9443 0.5891 2.1392 10.0248 0.6672 1.4259 0.1072 3.4187 0.5387 2.4403 0.5273 11.5037 71.7635 9.5703 0.6974 23.1578 2.9064 24.3506 19.9127 39.0484 5.2455 13.1462 8.2432 5.5536 0.6824 3.3311 0.0308 1.6712 7.6176 4.9731 9.6311 30.7606 7.8177 17.4897 53.8239 19.9458 19.1760 1.7320 12.8949 0.7113 5.9312 4.4387 15.1911 69.8015 27.5745 11.1832 41.4569 3.7232 2.9489 38.2528 18.6497 136.3615 0.8393 3.0829 22.9849 12.3336 24.0098 0.7745 24.7578 36.9859 3.5652 2.7339 8.5317 9.4096 4.5587 24.9735 69.0797 25.9025 27.9823 12.8051 32.1462 22.8777 93.9686 8.7494 23.3299 1.3682 4.4413 7.8870 2.8510 5.5066 16.6525 12.6375 8.0564 6.1248 15.9147 10.5032 521.7516 50.7646 87.5148 0.5234 30.2349 39.2293 290.0556 13.2364 16.6061 43.6376 34.9123 40.2199 20.1361 80.6680 10.5471 22.7733 22.5736 14.0839 61.6252 43.3069 29.6290 82.6060 37.7293 42.8638 34.8932 40.9447 36.1559 9.2469 27.6274 23.9957 15.9688 21.6687 21.4821
temp: 298.150 k
press: 1.00000 atm
elementType: 8 7 7 7 6 6 6 6 6 6 6 6 6 6 6 6 6 6 6 6 6 6 6 1 1 1 1 1 1 1 1 1 1 1 1 1 1 1 1 1 1 1 1 1 1 1 1 1 1 1 1 1
symmnumber: 1
zpe: 1173179.5 jmol-1
zpe.correction: 0.446840 hartree
zpe.thermalcorrener: 0.471888 hartree
zpe.thermalcorrenthalpy: 0.472832 hartree
zpe.thermalcorrgfe: 0.387844 hartree
zpe.sumelectzpe: -979.107065 hartree
zpe.sumelectthermal: -979.082018 hartree
zpe.sumelectthermalent: -979.081074 hartree
zpe.sumelectthermalfe: -979.166061 hartree
dipole: 4.0922 2.2574 0.3787
dipole: 4.6889
quadrupole: -141.7857 -131.8235 -135.8290
quadrupole: 2.4765 0.1121 4.2121
quadrupole: -5.3063 4.6559 0.6504 2.4765 0.1121 4.2121
hfenergy: -979.5539057 hartree
pointgroup: C01 [X(C19H29N3O1)]
dipole: -1.6643578 -0.722061 0.334151 debye
polarizability: 291.2040366|40.0325383|204.3951559|18.3287814|-30.7183847|222.7956585 unknown
InChI: InChI=1S/C19H29N3O/c1-5-22(6-2)14-8-9-15(3)21-17-12-13-20-19-16(17)10-7-11-18(19)23-4/h7,10-13,15,21H,5-6,8-9,14H2,1-4H3
charge 0 multiplicity 1
52 atoms
O  4.926325 1.114961 -0.056972
N  -3.283317 1.745482 0.508471
N  -0.510421 -1.966148 0.193514
N  2.441868 0.571793 -1.570225
C  -2.85095 -1.162377 -0.306817
C  -1.816394 -2.321681 -0.403217
C  -3.186432 -0.708614 1.129136
C  -3.997102 0.610862 1.15018
C  -2.316819 -3.623351 0.25799
C  -2.202199 2.307124 1.365984
C  -4.209538 2.792175 -0.002443
C  0.434846 -1.130398 -0.373928
C  1.672868 -0.836927 0.346866
C  -1.084051 2.989641 0.554661
C  -4.912367 2.390245 -1.313675
C  0.257713 -0.543803 -1.646698
C  2.648173 0.017959 -0.309889
C  1.934223 -1.3471 1.654655
C  3.882067 0.310554 0.393881
C  1.278421 0.282108 -2.184313
C  3.131323 -1.031861 2.309386
C  4.100445 -0.211786 1.683031
C  5.072655 1.579903 -1.448712
H  -2.473648 -0.27491 -0.847723
H  -3.776865 -1.48543 -0.826884
H  -1.647955 -2.533189 -1.480258
H  -2.243877 -0.573516 1.696116
H  -3.774691 -1.479559 1.666619
H  -4.942882 0.447337 0.599611
H  -4.28233 0.85029 2.206846
H  -0.305446 -2.371163 1.105528
H  -2.446361 -3.498629 1.349959
H  -3.29603 -3.911825 -0.161747
H  -1.608779 -4.453599 0.084907
H  -2.61729 3.02153 2.12247
H  -1.754916 1.474515 1.938708
H  -4.974669 3.069036 0.767883
H  -3.614273 3.703965 -0.190896
H  -0.625948 2.26776 -0.143725
H  -1.462957 3.843893 -0.035795
H  -0.296284 3.373094 1.22978
H  -4.161357 2.166199 -2.091306
H  -5.547783 1.494967 -1.185972
H  -5.561018 3.21155 -1.672076
H  -0.649146 -0.711254 -2.231384
H  1.210345 -1.982998 2.177221
H  1.133987 0.731514 -3.174945
H  3.327827 -1.422055 3.313819
H  5.042023 0.037271 2.181224
H  4.284223 2.29955 -1.7133
H  6.070134 2.050115 -1.459379
H  5.027629 0.736781 -2.157368
