program: Gaussian 09
title: 000245034
version: EM64L-G09RevD.01
frameworkgroup: C1[X(C9H4Cl4O4)]
method: RPBEPBE
basis: SDD
operation: Freq
keyword: #p
keyword: freq=noraman
keyword: PBEPBE/SDD
title: #p freq=noraman PBEPBE/SDD
converged: YES YES NO NO
title: Mulliken charges:
elementType: Cl Cl Cl Cl O O O O C C C C C C C C C H H H H
charge: 0.061062 0.051947 0.072089 0.072304 -0.265192 -0.381563 -0.185975 -0.213852 0.380665 0.417659 -0.371174 -0.309074 -0.092204 -0.090742 0.136063 0.078978 -0.498095 0.236731 0.253159 0.256090 0.391123
chargesum: 0.00000
title: Mulliken charges with hydrogens summed into heavy atoms:
elementType: Cl Cl Cl Cl O O O O C C C C C C C C C
charge: 0.061062 0.051947 0.072089 0.072304 -0.265192 0.009561 -0.185975 -0.213852 0.380665 0.417659 -0.371174 -0.309074 -0.092204 -0.090742 0.136063 0.078978 0.247885
polarizability: 2.01847601e+02 6.01742514e-01 1.85810312e+02 3.88420887e+00 -4.31976760e+00 7.54526473e+01
1716.lowfreq: -3.9157 -0.0025 -0.0015 -0.0008 1.1489 6.1630 29.8437 44.1500 56.6417
frequency: 29.8001 44.1462 56.6406 74.4536 77.9895 89.3131 109.9574 120.2888 160.0378 198.7871 207.5589 210.6017 219.9035 230.8388 256.5654 272.3935 290.9867 301.6916 328.4499 350.8561 391.5604 411.9179 524.7944 544.9863 587.6146 607.5949 624.7284 652.1898 674.6781 706.2153 743.5831 768.0496 807.6594 832.0220 859.1799 932.8079 1027.4771 1081.9837 1115.1653 1151.4038 1158.7182 1219.2482 1289.8883 1338.0241 1339.7474 1385.0315 1420.7351 1452.9284 1462.0569 1525.1557 1552.2754 1640.5822 1646.2474 3009.0820 3115.6724 3157.4376 3513.5111
redmass: 7.5703 8.6705 17.4803 3.4283 12.5512 1.7804 2.5020 11.6326 8.7656 18.4525 16.9757 8.2690 28.2382 7.7632 10.7784 8.8547 17.6328 5.7330 23.6807 23.7499 11.6133 7.5915 3.1206 6.3989 3.2313 6.9906 3.1643 10.5406 8.1354 8.8053 7.5754 11.2896 11.8249 10.0210 10.7921 10.0603 5.7060 3.9597 1.2817 1.4537 4.5615 9.1323 3.1202 10.8414 10.6750 7.5553 1.2104 1.0499 1.0509 11.9254 11.9800 10.1095 10.8011 1.0292 1.1051 1.1053 1.0641
irintensity: 0.3350 0.3402 0.4061 3.9731 0.3633 1.4256 0.2712 1.2518 0.4748 0.1035 0.7490 1.8831 0.2185 1.1402 0.0606 3.1344 0.9435 17.4938 0.6443 0.6821 1.7471 1.6073 12.5780 63.5754 57.7874 68.8737 49.0499 22.7085 16.5534 10.5150 5.5021 7.2517 0.3503 13.5314 5.2000 11.0453 78.5867 341.3067 2.1056 23.3099 126.3284 287.1103 109.8557 46.2211 30.3573 50.4887 22.4434 15.4911 10.6968 34.9079 22.7739 128.5271 277.5488 25.6918 14.7343 11.5396 46.6206
temp: 298.150 k
press: 1.00000 atm
elementType: 17 17 17 17 8 8 8 8 6 6 6 6 6 6 6 6 6 1 1 1 1
symmnumber: 1
zpe: 298487.5 jmol-1
zpe.correction: 0.113688 hartree
zpe.thermalcorrener: 0.131154 hartree
zpe.thermalcorrenthalpy: 0.132098 hartree
zpe.thermalcorrgfe: 0.066034 hartree
zpe.sumelectzpe: -2485.240732 hartree
zpe.sumelectthermal: -2485.223266 hartree
zpe.sumelectthermalent: -2485.222322 hartree
zpe.sumelectthermalfe: -2485.288386 hartree
dipole: 1.8181 1.6709 -2.3719
dipole: 3.4239
quadrupole: -109.7018 -119.9936 -129.6083
quadrupole: 5.5264 -10.4521 1.0228
quadrupole: 10.0661 -0.2257 -9.8404 5.5264 -10.4521 1.0228
hfenergy: -2485.35442 hartree
pointgroup: C01 [X(C9H4Cl4O4)]
dipole: -0.6795712 -0.5564097 -1.0213723 debye
dipolederiv: -0.0361603 0.145581 -0.0000717 0.1109573 -0.6303235 -0.0507657 -0.0055501 -0.0285376 0.0180605 -0.0768982 0.14762 0.0171847 0.187623 -0.6468771 -0.0388322 0.0297828 -0.0172765 0.0128035 -0.3831803 -0.3490358 -0.0231923 -0.3627789 -0.3201666 -0.0211385 -0.0175025 -0.0203058 0.0202953 -0.664907 0.1825786 0.0268003 0.1893124 -0.048154 -0.0081296 0.022191 -0.0044515 0.0209519 -1.2218951 0.0010331 -0.353709 -0.0792254 -0.374697 -0.1739747 -0.5905046 -0.1234486 -0.7324086 -0.349434 -0.055697 -0.1198343 -0.0458961 -0.6540116 -0.4283451 -0.1484129 -0.4650374 -0.8789333 -0.7109039 0.1968499 0.1612374 0.0878198 -0.4238138 -0.2749197 -0.119816 -0.191548 -0.6689565 -0.7568172 -0.1829902 0.3177031 -0.2241689 -0.539623 0.0293289 0.1219003 -0.0892095 -0.6985855 -0.3894217 0.0569138 -0.0155411 0.1893349 -0.1053093 -0.0408887 0.0550913 0.0082073 -0.0084805 -0.1805461 -0.1383018 0.0076699 -0.2750066 -0.3181729 -0.0693352 -0.0473169 -0.0012929 -0.0096678 -0.0530756 -0.3374496 -0.0219511 -0.2412552 0.9204553 0.0735022 0.0306868 0.044057 -0.0513767 -0.0828958 -0.1579968 0.0100729 -0.2516759 0.9831211 0.057832 -0.072371 0.0126263 -0.0369134 0.4011779 0.6619924 0.0427053 0.6660178 0.2914035 0.0138964 0.028415 0.0223524 -0.007396 0.9160066 -0.3493189 -0.0438761 -0.3367048 -0.2296157 -0.0010961 -0.0337471 -0.0092749 -0.0151662 1.6232024 -0.1786926 0.1674426 -0.0294806 0.4868826 0.5189268 0.5958746 0.3295971 1.1358596 1.0645349 0.4845847 -0.2795392 0.567038 1.0314812 0.4058701 -0.0780494 0.4704245 1.2698986 0.6795707 -0.0116136 0.127766 -0.0610843 0.2167523 -0.042479 0.1070865 -0.020182 0.2458433 0.0276428 -0.0045187 -0.0439923 -0.0405938 0.1004802 -0.0669518 -0.096963 -0.0484839 -0.0505491 0.0076132 -0.0060125 -0.0302897 0.0757714 -0.0735526 0.0022482 0.0299938 -0.0381635 0.1118007 -0.0220296 -0.0158181 -0.0209985 -0.0355616 0.0349443 0.0851798 0.0730037 0.085231 -0.0021317 0.2084161 -0.089708 0.0744132 -0.0904425 0.2987965 0.0300719 0.1162074 0.0847165 0.3250519 unknown
polarizability: 201.9282153|0.9872263|183.3125804|-1.0317529|17.072822|77.8697649 unknown
InChI: InChI=1S/C9H4Cl4O4/c1-17-9(16)3-2(8(14)15)4(10)6(12)7(13)5(3)11/h14H,1H3
charge 0 multiplicity 1
21 atoms
Cl 0.242363 3.333473 0.311658
Cl 1.754972 -2.885286 -0.229035
Cl 3.310224 2.429549 0.161575
Cl 4.062483 -0.674197 -0.114576
O  -2.564582 0.536862 -0.825146
O  -1.131026 -2.523187 -1.268656
O  -2.305806 1.694284 1.184991
O  -2.013907 -1.921682 0.794631
C  -0.379982 0.620025 0.105479
C  -0.046367 -0.751573 -0.070319
C  0.65093 1.584698 0.173752
C  1.311452 -1.139401 -0.126079
C  2.008812 1.196271 0.090957
C  2.34119 -0.172795 -0.04666
C  -1.827435 1.025564 0.248327
C  -1.157896 -1.770983 -0.102995
C  -4.032332 0.753505 -0.74172
H  -4.420088 0.417102 -1.71265
H  -4.248905 1.820326 -0.56917
H  -4.442654 0.151863 0.086489
H  -1.856946 -3.204818 -1.244252
