program: Gaussian 09
title: 000245026
version: EM64L-G09RevD.01
frameworkgroup: C1[X(C8H16Cl3N2OP)]
method: RPBEPBE
basis: SDD
operation: Freq
keyword: #p
keyword: freq=noraman
keyword: PBEPBE/SDD
title: #p freq=noraman PBEPBE/SDD
converged: YES YES NO NO
title: Mulliken charges:
elementType: Cl Cl Cl P O N N C C C C C C C C H H H H H H H H H H H H H H H H
charge: -0.003521 -0.073882 -0.065543 1.339883 -0.626513 -0.500332 -0.744863 -0.304158 -0.298289 -0.800402 -0.556536 -0.558233 -0.435826 0.013546 -0.559882 0.229207 0.271147 0.244641 0.247828 0.330910 0.267296 0.329072 0.256826 0.305492 0.272370 0.264976 0.231274 0.261294 0.214298 0.223960 0.223960
chargesum: 0.00000
title: Mulliken charges with hydrogens summed into heavy atoms:
elementType: Cl Cl Cl P O N N C C C C C C C C
charge: -0.003521 -0.073882 -0.065543 1.339883 -0.626513 -0.500332 -0.413953 0.196196 0.194181 -0.204034 0.005781 -0.020887 0.056742 0.227843 -0.111961
polarizability: 1.64277426e+02 -6.24854740e+00 1.48269298e+02 5.30363022e-01 3.44876951e+00 1.47878050e+02
1716.lowfreq: -12.4370 -8.5723 -0.0016 -0.0011 -0.0006 3.2010 9.0989 24.7623 30.9834
frequency: 2.1199 24.5521 30.9644 34.3738 47.4499 56.3159 66.2370 74.9122 84.1061 87.9598 109.4522 161.3608 190.1113 193.9588 211.3506 213.7976 238.9953 247.4485 250.5414 295.8826 339.7755 347.1375 399.2720 430.7243 462.0189 478.1233 600.9307 615.8932 659.6488 681.6952 684.0871 722.9924 756.4997 772.5935 777.5257 808.7826 904.4984 939.7809 949.1815 963.3283 993.3483 1002.4868 1014.9609 1031.2865 1043.8255 1055.3369 1074.5093 1114.9616 1118.7913 1139.6026 1207.3330 1217.8116 1229.3061 1241.8018 1249.7101 1256.8345 1284.2034 1285.0119 1326.1298 1337.8645 1344.6716 1358.5923 1376.5944 1392.0950 1429.9141 1448.5671 1453.5418 1457.9729 1461.3768 1472.3077 1655.9715 2987.0431 2998.3988 3018.7488 3049.3465 3050.5843 3057.8135 3059.6337 3063.1026 3084.0482 3085.9594 3098.6970 3147.5614 3149.8505 3152.9363 3197.2018 3565.5464
redmass: 7.1206 4.6353 16.6857 5.8939 4.9966 5.4539 3.7974 2.5800 2.4579 2.6269 4.7904 4.0477 3.3685 3.6639 7.1595 4.5461 5.6653 1.5001 6.7128 3.0518 3.0533 2.4457 3.4545 2.6165 4.8155 6.3602 5.3749 2.2754 3.9482 5.4557 4.3109 5.1853 3.3916 1.2857 1.1867 1.6347 1.5486 1.9562 2.5716 1.3468 1.4136 1.1805 5.7982 1.7119 4.0525 2.7701 5.0862 1.4924 1.1891 1.5923 2.4890 1.1813 1.5859 1.2021 1.1721 1.1860 1.2028 1.1936 1.2304 1.2204 1.2381 1.2465 1.2032 1.0872 1.1785 1.0796 1.0916 1.0797 1.0865 1.0751 4.6354 1.0613 1.0607 1.0611 1.0555 1.1008 1.0574 1.1018 1.0573 1.0655 1.1034 1.0896 1.1118 1.1101 1.1120 1.1147 1.0772
irintensity: 0.6099 0.1319 1.4243 0.4594 2.3741 3.6101 0.7057 2.3876 1.6844 2.8743 1.8117 4.1771 3.6859 15.9260 1.6764 0.7381 5.2633 114.6528 8.3765 2.7447 21.0536 5.0541 34.7406 11.8225 35.5338 4.2954 25.2796 52.9249 9.4435 109.5886 86.1939 27.8598 72.8762 4.5072 18.8828 28.0681 2.9588 14.9860 88.9872 90.5297 2.1856 34.6308 65.1787 16.2512 4.0446 18.0648 153.9870 37.3093 13.1038 5.0733 69.4831 0.0812 9.1589 26.2491 9.4480 12.9647 2.6899 7.7064 12.1299 1.4670 0.2675 0.6427 21.0827 9.0339 11.3417 9.6663 0.3944 27.5441 21.3389 6.7113 3.9368 37.8519 14.7864 11.9682 9.7822 3.5911 14.6871 4.9546 16.9502 16.0263 3.9542 6.7876 12.1986 3.3485 6.4069 19.8655 18.3890
temp: 298.150 k
press: 1.00000 atm
elementType: 17 17 17 15 8 7 7 6 6 6 6 6 6 6 6 1 1 1 1 1 1 1 1 1 1 1 1 1 1 1 1
symmnumber: 1
zpe: 626601.4 jmol-1
zpe.correction: 0.238660 hartree
zpe.thermalcorrener: 0.258943 hartree
zpe.thermalcorrenthalpy: 0.259887 hartree
zpe.thermalcorrgfe: 0.182655 hartree
zpe.sumelectzpe: -2219.319987 hartree
zpe.sumelectthermal: -2219.299704 hartree
zpe.sumelectthermalent: -2219.298760 hartree
zpe.sumelectthermalfe: -2219.375992 hartree
dipole: -3.1673 4.3744 1.7307
dipole: 5.6712
quadrupole: -130.8029 -115.8640 -130.9598
quadrupole: -2.7517 12.1664 2.7585
quadrupole: -4.9274 10.0116 -5.0842 -2.7517 12.1664 2.7585
hfenergy: -2219.5586471 hartree
pointgroup: C01 [X(C8H16Cl3N2O1P1)]
dipole: -0.8869874 -1.2572305 1.6158392 debye
polarizability: 146.7470365|-4.7841027|159.4916493|-0.8135603|-8.616456|154.1860886 unknown
InChI: InChI=1S/C8H16Cl3N2OP/c1-2-5-12-15(14,8-11)13(6-3-9)7-4-10/h2,12H,1,3-8H2
charge 0 multiplicity 1
31 atoms
Cl 1.908688 -2.751025 -1.557714
Cl 1.023122 3.530462 -2.517773
Cl 2.913357 -0.085739 3.287048
P  -0.553886 -1.073342 -0.654025
O  -1.26413 -0.636136 -2.022552
N  0.6554 0.113212 -0.190749
N  -1.629085 -1.306768 0.690566
C  1.162233 1.041997 -1.230085
C  1.079128 0.312925 1.204443
C  0.24649 -2.795466 -0.710888
C  0.214602 2.243368 -1.387726
C  2.429534 -0.373373 1.477711
C  -2.87031 -0.502739 0.824575
C  -2.702294 0.728389 1.699121
C  -2.964625 1.994535 1.29019
H  2.172169 1.384151 -0.939039
H  1.251499 0.519307 -2.197442
H  1.165384 1.394985 1.418341
H  0.305763 -0.084141 1.886871
H  -1.479337 -2.06783 1.35381
H  0.410952 -3.197894 0.300755
H  -0.405092 -3.452783 -1.304079
H  0.022809 2.758158 -0.433965
H  -0.721858 1.946013 -1.879987
H  3.249418 0.049277 0.878807
H  2.387735 -1.464306 1.344542
H  -3.65391 -1.164101 1.243366
H  -3.202229 -0.209844 -0.188779
H  -2.354742 0.546664 2.727763
H  -2.847397 2.853193 1.960984
H  -3.31239 2.20745 0.271313
