program: Gaussian 09
title: 000245023
version: EM64L-G09RevD.01
frameworkgroup: C1[X(C7H14Cl4NO2P)]
method: RPBEPBE
basis: SDD
operation: Freq
keyword: #p
keyword: freq=noraman
keyword: PBEPBE/SDD
title: #p freq=noraman PBEPBE/SDD
converged: NO YES NO NO
title: Mulliken charges:
elementType: Cl Cl Cl Cl P O O N C C C C C C C H H H H H H H H H H H H H H
charge: -0.003747 -0.054549 -0.055577 -0.060938 1.313760 -0.518637 -0.616649 -0.525214 -0.307363 -0.311965 -0.787161 -0.560591 -0.553974 -0.221078 -0.535913 0.246302 0.264111 0.281564 0.235231 0.298534 0.336293 0.269263 0.283903 0.257125 0.289031 0.228897 0.267791 0.262761 0.278788
chargesum: 0.00000
title: Mulliken charges with hydrogens summed into heavy atoms:
elementType: Cl Cl Cl Cl P O O N C C C C C C C
charge: -0.003747 -0.054549 -0.055577 -0.060938 1.313760 -0.518637 -0.616649 -0.525214 0.203050 0.204831 -0.152334 -0.007424 -0.007817 0.275611 0.005636
polarizability: 1.60726722e+02 6.35911904e-01 1.50744900e+02 -2.03609410e+00 9.72763583e-01 1.37373808e+02
1716.lowfreq: -10.6650 -4.8433 -0.0021 -0.0014 -0.0010 2.1964 13.7959 18.6167 32.1639
frequency: 12.9621 18.4048 32.0657 37.6721 52.7699 56.1571 78.3159 87.6049 88.4144 91.7494 116.7597 140.0110 186.1396 198.7055 208.6774 217.5980 228.4437 250.4540 261.7711 286.7755 348.0226 367.3233 409.1103 449.3542 479.5798 584.4327 607.2358 628.2450 662.4311 691.0472 695.4595 744.1772 773.6775 776.1368 825.1538 850.0634 934.7875 955.8894 991.5680 998.0082 1025.5504 1037.3663 1045.3140 1058.7116 1074.3321 1115.4064 1125.9998 1173.6047 1206.5435 1223.0056 1227.2661 1232.3283 1253.3270 1256.9776 1288.4815 1297.4311 1334.5653 1352.7963 1364.5988 1365.6034 1397.4500 1430.5065 1448.6862 1452.4582 1456.8919 1464.7376 1481.0952 2983.4588 3002.6308 3022.4852 3047.8932 3057.4809 3062.4076 3065.0759 3068.0858 3072.3541 3089.3828 3146.8889 3147.7014 3151.2723 3165.7293
redmass: 7.6628 14.4700 14.2148 12.3166 16.7120 8.0203 4.7839 6.0461 2.2892 2.5825 6.1719 4.1942 3.0727 6.6881 7.1274 4.3634 5.8632 7.8978 2.9233 3.9324 5.2267 3.6827 3.2858 5.1287 6.7547 6.0887 5.4708 5.5833 7.5245 5.5354 4.9156 4.4531 1.1746 1.1902 1.6570 2.2960 2.3180 2.5984 1.9210 1.4310 4.7499 2.1972 4.2108 2.1436 2.6101 1.5950 1.1601 1.2322 2.3229 1.1502 1.1482 1.5690 1.1705 1.1639 1.1492 1.1783 1.2367 1.2312 1.2462 1.2480 1.0719 1.1005 1.0819 1.0767 1.0926 1.0843 1.0741 1.0572 1.0623 1.0612 1.0974 1.0565 1.0667 1.0658 1.0922 1.0555 1.1040 1.1099 1.1123 1.1118 1.1107
irintensity: 1.1915 0.5461 1.2277 0.8728 0.4463 0.4862 9.1991 0.4497 0.8496 0.1616 2.9236 8.3416 6.8343 7.1756 0.2931 0.6947 0.7382 18.2073 6.1083 19.6617 9.4101 19.7454 20.6212 19.5268 19.2953 42.4145 0.9674 116.2516 5.3900 98.1415 74.4500 59.5279 1.8611 22.0214 22.9537 100.8740 129.6124 79.0728 69.9363 1.7894 54.5976 20.6423 5.4405 35.1688 53.2880 34.9049 33.9302 2.1209 70.8579 2.3615 1.8390 10.3113 8.9262 9.5423 6.2970 16.0735 13.9997 0.5627 1.6375 7.2914 11.5413 11.9404 5.3980 18.0583 5.3651 21.0498 14.2481 37.4233 13.0850 10.1692 3.0039 16.0140 22.9033 11.4997 4.7478 2.0767 1.2115 8.2589 9.1863 10.4296 2.4270
temp: 298.150 k
press: 1.00000 atm
elementType: 17 17 17 17 15 8 8 7 6 6 6 6 6 6 6 1 1 1 1 1 1 1 1 1 1 1 1 1 1
symmnumber: 1
zpe: 560432.7 jmol-1
zpe.correction: 0.213458 hartree
zpe.thermalcorrener: 0.233356 hartree
zpe.thermalcorrenthalpy: 0.234300 hartree
zpe.thermalcorrgfe: 0.159107 hartree
zpe.sumelectzpe: -2660.567511 hartree
zpe.sumelectthermal: -2660.547613 hartree
zpe.sumelectthermalent: -2660.546668 hartree
zpe.sumelectthermalfe: -2660.621862 hartree
dipole: 1.8109 0.5498 -3.7325
dipole: 4.1849
quadrupole: -133.6153 -139.7011 -126.4831
quadrupole: -3.5434 -11.8356 11.7788
quadrupole: -0.3488 -6.4346 6.7834 -3.5434 -11.8356 11.7788
hfenergy: -2660.7809683 hartree
pointgroup: C01 [X(C7H14Cl4N1O2P1)]
dipole: -0.7728878 -0.7618945 1.2381375 debye
polarizability: 159.9277504|-2.0724042|144.5422969|-2.2124483|7.3371713|144.3753824 unknown
InChI: InChI=1S/C7H14Cl4NO2P/c8-1-4-12(5-2-9)15(13,7-11)14-6-3-10/h1-7H2
charge 0 multiplicity 1
29 atoms
Cl 0.327167 3.466142 -0.366598
Cl 3.348869 0.578165 3.05855
Cl 2.58605 -2.582988 -3.139021
Cl -4.456219 1.137278 0.467056
P  -0.655879 0.52961 -0.496186
O  -1.567189 -0.390048 0.709956
O  -1.177769 0.379244 -1.996355
N  0.980097 -0.021304 -0.294259
C  1.579358 -0.207731 1.045272
C  1.722439 -0.493934 -1.487417
C  -0.843915 2.200353 0.342698
C  2.569489 0.924342 1.371071
C  1.440215 -1.980852 -1.762537
C  -2.771706 -1.122083 0.272792
C  -3.993203 -0.610203 1.020907
H  2.106833 -1.179631 1.084344
H  0.784914 -0.254083 1.811516
H  1.430228 0.102259 -2.36836
H  2.802354 -0.336613 -1.314624
H  -0.63477 2.102042 1.416962
H  -1.873325 2.545944 0.173891
H  3.406559 0.971501 0.659208
H  2.083633 1.906831 1.451206
H  1.654412 -2.621949 -0.893889
H  0.415949 -2.136449 -2.13129
H  -2.615542 -2.185938 0.539232
H  -2.898767 -1.03705 -0.823882
H  -4.877933 -1.23155 0.810632
H  -3.81095 -0.537402 2.102624
