program: Gaussian 09
title: 000245021
version: EM64L-G09RevD.01
frameworkgroup: C1[X(C7H15Cl3NO2P)]
method: RPBEPBE
basis: SDD
operation: Freq
keyword: #p
keyword: freq=noraman
keyword: PBEPBE/SDD
title: #p freq=noraman PBEPBE/SDD
converged: YES YES NO NO
title: Mulliken charges:
elementType: Cl Cl Cl P O O N C C C C C C C H H H H H H H H H H H H H H H
charge: -0.061919 -0.050193 -0.053944 1.271951 -0.488344 -0.600482 -0.532094 -0.314301 -0.291015 -0.929928 -0.568151 -0.563695 -0.194213 -0.558553 0.236585 0.283514 0.242793 0.255080 0.296940 0.280319 0.247843 0.250477 0.322134 0.277766 0.251347 0.230183 0.216041 0.290308 0.253550
chargesum: 0.00000
title: Mulliken charges with hydrogens summed into heavy atoms:
elementType: Cl Cl Cl P O O N C C C C C C C
charge: -0.061919 -0.050193 -0.053944 1.271951 -0.488344 -0.600482 -0.532094 0.205798 0.206858 -0.104826 0.004460 -0.034581 0.252011 -0.014694
polarizability: 1.46167604e+02 9.38867161e+00 1.47766872e+02 1.39211912e-01 -9.52922016e+00 1.28481205e+02
1716.lowfreq: -11.1307 -7.5171 -0.0020 -0.0018 0.0007 6.4574 18.4619 24.1526 34.0732
frequency: 17.9633 23.7360 34.0028 40.6621 64.0674 70.8434 95.0667 104.3141 108.7814 124.6276 186.3163 194.7703 204.6289 209.2733 221.6868 223.7290 234.0404 275.7181 295.5014 347.2317 357.8039 395.3587 431.0266 479.2966 583.2859 608.6465 645.0195 684.5471 690.1874 721.2472 773.7992 781.8639 861.2226 914.6296 940.6150 942.7464 952.3738 989.8342 998.8349 1032.0708 1044.3706 1052.7299 1055.0070 1082.0706 1111.4405 1167.0479 1192.9318 1223.2171 1232.5376 1249.4364 1258.0598 1284.9661 1299.6592 1326.6508 1336.0026 1350.8291 1356.3381 1360.8996 1428.2262 1428.9379 1443.7645 1448.7486 1453.7175 1460.2033 1470.5605 1479.4421 2943.9962 3005.7420 3012.4212 3014.8759 3016.2893 3054.9763 3057.5916 3061.7382 3070.4567 3080.7082 3131.8063 3136.1678 3141.8060 3149.1387 3151.5088
redmass: 12.2702 6.2444 12.8201 12.4636 5.9456 6.6134 2.3117 3.3096 2.8399 4.2173 1.2328 3.6956 2.7256 6.7435 3.4533 4.3729 3.8610 4.0864 3.4441 4.6340 3.9836 3.7010 3.9782 7.2397 5.0227 4.8238 5.1049 5.4361 5.5765 4.9883 1.1697 1.1792 2.3049 1.5077 1.3768 2.6210 2.1651 2.0671 1.5086 1.9481 3.9315 6.1838 2.2325 2.6522 1.7487 1.1607 2.1037 1.1430 1.5633 1.1674 1.1764 1.1366 1.1904 1.2242 1.1746 1.2196 1.2820 1.2509 1.0769 1.0686 1.0518 1.0790 1.0807 1.0847 1.0873 1.0733 1.0576 1.0625 1.1011 1.0330 1.0613 1.0565 1.0580 1.0586 1.1009 1.1044 1.1015 1.1017 1.1117 1.1096 1.1111
irintensity: 1.5294 3.5692 2.3223 0.0704 4.0768 1.7754 0.4014 1.4859 5.0934 1.2781 0.5880 4.6889 3.4343 1.6873 2.3299 2.0845 5.4363 23.9802 14.9481 8.0407 19.5066 35.0102 12.2150 11.4475 26.7104 15.6859 46.0521 75.4309 93.5686 100.8706 2.4115 18.8954 54.7863 6.3098 50.4709 94.1048 59.3439 61.6768 3.7999 4.1184 10.5511 136.7869 27.9484 14.4170 68.6670 3.0530 51.4523 0.8471 10.0290 15.1782 8.1997 2.7675 13.4527 17.5294 26.2097 2.6569 6.9955 1.6264 1.6806 21.7861 9.4609 6.7339 8.9543 5.3402 36.0360 2.3337 47.0462 15.4191 16.1900 2.6575 9.7840 19.1214 23.0991 23.3212 6.7905 4.2114 4.4337 2.4527 15.0109 6.5020 6.0220
temp: 298.150 k
press: 1.00000 atm
elementType: 17 17 17 15 8 8 7 6 6 6 6 6 6 6 1 1 1 1 1 1 1 1 1 1 1 1 1 1 1
symmnumber: 1
zpe: 583110.1 jmol-1
zpe.correction: 0.222095 hartree
zpe.thermalcorrener: 0.240844 hartree
zpe.thermalcorrenthalpy: 0.241788 hartree
zpe.thermalcorrgfe: 0.170920 hartree
zpe.sumelectzpe: -2201.178556 hartree
zpe.sumelectthermal: -2201.159808 hartree
zpe.sumelectthermalent: -2201.158863 hartree
zpe.sumelectthermalfe: -2201.229731 hartree
dipole: -3.1599 -5.9974 -0.3665
dipole: 6.7888
quadrupole: -128.9041 -108.9861 -123.1049
quadrupole: -8.7692 -10.6690 -2.1082
quadrupole: -8.5724 11.3456 -2.7732 -8.7692 -10.6690 -2.1082
hfenergy: -2201.4006512 hartree
pointgroup: C01 [X(C7H15Cl3N1O2P1)]
dipole: 0.0464899 2.3072481 1.3447496 debye
polarizability: 138.9545411|-1.5902868|156.5365079|-5.6576339|6.0992388|126.9246325 unknown
InChI: InChI=1S/C7H15Cl3NO2P/c1-14(12,13-7-4-10)11(5-2-8)6-3-9/h2-7H2,1H3
charge 0 multiplicity 1
29 atoms
Cl -1.174982 -3.921277 -1.301216
Cl -3.559403 1.544688 2.36098
Cl 2.67172 -1.626236 1.887426
P  0.510339 0.922271 -1.201884
O  2.028504 0.740987 -0.325394
O  0.735267 0.360974 -2.675494
N  -0.662701 0.060748 -0.213397
C  -0.549373 -1.425863 -0.209906
C  -1.937264 0.643005 0.259351
C  0.085974 2.733671 -1.076584
C  -1.164304 -2.039566 -1.481704
C  -1.889499 0.877044 1.778948
C  2.128266 1.032355 1.109381
C  3.23184 0.164652 1.694109
H  -1.059906 -1.816547 0.688861
H  0.513917 -1.712337 -0.128271
H  -2.158024 1.595951 -0.251999
H  -2.77351 -0.040827 0.020395
H  0.93281 3.283149 -1.517899
H  -0.820861 2.954763 -1.660544
H  -0.049497 3.050883 -0.030489
H  -2.216947 -1.751736 -1.626552
H  -0.565659 -1.811105 -2.374553
H  -1.722167 -0.053554 2.341113
H  -1.147298 1.638674 2.063063
H  1.166955 0.843356 1.628685
H  2.413141 2.098279 1.244952
H  4.107607 0.135223 1.030512
H  3.510455 0.498278 2.705911
