program: Gaussian 09
title: 000245007
version: EM64L-G09RevD.01
frameworkgroup: C1[X(C7H13NO3)]
method: RPBEPBE
basis: SDD
operation: Freq
keyword: #p
keyword: freq=noraman
keyword: PBEPBE/SDD
title: #p freq=noraman PBEPBE/SDD
converged: YES YES NO NO
title: Mulliken charges:
elementType: O O O N C C C C C C C H H H H H H H H H H H H H
charge: -0.282112 -0.415024 -0.245154 -0.386227 -0.019135 -0.549122 0.262027 -0.712136 -0.668300 -0.471437 0.192334 0.246443 0.297345 0.222920 0.271765 0.226993 0.202944 0.231754 0.255464 0.211244 0.198551 0.255075 0.297667 0.376120
chargesum: 0.00000
title: Mulliken charges with hydrogens summed into heavy atoms:
elementType: O O O N C C C C C C C
charge: -0.282112 -0.038904 -0.245154 -0.088882 0.227308 -0.054437 0.262027 -0.050445 -0.003041 0.081306 0.192334
polarizability: 1.23924490e+02 -2.76684569e+00 7.87828526e+01 1.13264905e+00 -4.87935334e+00 7.77886832e+01
1716.lowfreq: -15.1217 -0.0008 -0.0004 0.0006 3.4078 4.6752 25.4334 32.7844 51.6360
frequency: 24.8515 32.4460 51.5429 63.9682 115.3594 118.4464 188.2164 216.2027 226.4267 257.5523 296.2241 377.1850 394.1811 434.5184 487.5295 521.5707 540.8341 566.3415 607.6596 648.5350 688.2787 792.5029 839.9819 874.0504 916.1588 917.7202 949.4668 969.4391 1014.4968 1053.0673 1096.0234 1142.4324 1144.1626 1161.1429 1180.8119 1220.7382 1239.2767 1263.3410 1304.6043 1328.1297 1354.8686 1374.6143 1376.2076 1392.4318 1442.0647 1454.2728 1461.2533 1467.8554 1470.6582 1487.4789 1488.3945 1611.3874 1662.6783 2974.3451 2981.4035 2985.2832 2993.0066 3022.3894 3044.0574 3068.1892 3074.1101 3080.3397 3092.1891 3097.4764 3512.9635 3535.0610
redmass: 4.1678 4.1746 5.0310 3.8778 2.3469 3.9326 3.5448 1.0598 3.6816 1.1924 3.9564 2.9023 2.8465 2.7128 2.4218 2.1371 1.5163 2.4947 2.8260 1.4892 4.4676 1.7317 2.4071 4.1452 1.5131 1.8873 1.5424 2.7063 2.1433 2.7050 2.3023 2.0860 1.5964 1.4869 2.0531 1.6914 1.3591 1.3765 1.4635 1.6645 1.3051 1.2585 1.8618 1.2307 1.0720 1.1049 1.1377 1.0842 1.2123 1.0478 1.4103 6.6252 8.0328 1.0379 1.0362 1.0647 1.0608 1.0847 1.0990 1.0980 1.0953 1.0991 1.0995 1.1000 1.0639 1.0776
irintensity: 0.5359 0.1611 8.4889 1.7360 0.8218 3.2760 14.3360 0.2737 1.2553 1.2533 7.5060 9.2513 9.2153 6.3381 12.8219 37.2954 94.1964 50.7236 9.5003 117.8188 2.8058 11.5887 3.0812 4.3044 4.7264 0.0538 0.2923 5.2782 73.7198 213.2187 39.6024 17.3986 1.6545 0.8640 36.7160 54.4497 56.7722 24.2056 0.7133 50.7292 15.0783 31.1353 44.1644 28.3053 13.3083 46.6907 72.8421 31.5895 83.0988 23.3265 109.0128 173.5864 200.1703 25.2875 28.8233 15.9595 31.9628 1.3251 11.7572 15.4491 10.4937 59.2065 30.8663 27.5638 22.8957 15.7001
temp: 298.150 k
press: 1.00000 atm
elementType: 8 8 8 7 6 6 6 6 6 6 6 1 1 1 1 1 1 1 1 1 1 1 1 1
symmnumber: 1
zpe: 519002.2 jmol-1
zpe.correction: 0.197678 hartree
zpe.thermalcorrener: 0.210708 hartree
zpe.thermalcorrenthalpy: 0.211652 hartree
zpe.thermalcorrgfe: 0.156122 hartree
zpe.sumelectzpe: -554.117110 hartree
zpe.sumelectthermal: -554.104080 hartree
zpe.sumelectthermalent: -554.103136 hartree
zpe.sumelectthermalfe: -554.158665 hartree
dipole: 1.8366 -3.0003 -0.3290
dipole: 3.5332
quadrupole: -53.5823 -68.8757 -71.6212
quadrupole: -3.8900 3.8374 2.8432
quadrupole: 11.1108 -4.1826 -6.9282 -3.8900 3.8374 2.8432
hfenergy: -554.3147874 hartree
pointgroup: C01 [X(C7H13N1O3)]
dipole: -0.6879526 1.117646 -0.4581051 debye
dipolederiv: -0.7902311 -0.0533293 -0.006015 0.3144111 -0.947957 -0.0012799 0.0012213 -0.0056113 -0.3501634 -1.0497652 0.3009661 0.4611589 0.2684133 -0.4867579 -0.089382 0.4302752 -0.0898483 -0.5578413 -0.7401418 -0.0813774 -0.1377035 0.0451344 -0.522023 -0.3087494 0.0382809 -0.3062407 -0.7754783 -1.2765007 0.3173539 0.0168143 0.3711585 -0.4560598 0.0826593 -0.0723807 0.1213556 -0.5165017 0.6988662 0.0141358 -0.0374961 0.2073015 0.155665 -0.0430789 0.0179093 -0.0899791 0.3591525 -0.2956553 -0.0879954 -0.0104939 -0.192925 -0.0155862 -0.0835149 -0.1342114 -0.1042577 0.0851569 1.4992843 -0.227187 0.0541956 -0.569605 1.1463313 0.0017824 0.1217729 0.0005491 0.1708202 -0.0894884 0.0298073 -0.0220771 0.0140308 0.0557999 0.0810434 -0.0374032 0.0872924 0.0109587 -0.0833746 0.0382981 0.0025205 -0.0256683 0.0599235 0.0738192 0.013497 0.110382 -0.1144914 -0.3114911 -0.06415 -0.0862784 -0.3238166 -0.0554862 -0.1197112 -0.1522159 -0.0894166 0.0289705 1.6261439 -0.0940014 -0.1458136 -0.1094354 0.576455 0.5533084 -0.197518 0.5400161 1.0061222 0.0324817 0.0421179 0.0296472 -0.0442275 -0.0332994 -0.0761781 0.009421 -0.0464331 -0.0109306 0.147929 -0.0097083 0.0013131 -0.0632403 0.0856831 -0.0113835 0.0007558 -0.0312907 0.305964 0.0158744 0.041198 -0.014738 0.0409161 -0.105695 0.0757666 0.0191426 0.0968347 0.0537899 0.1145008 -0.0156623 -0.0066577 0.0230814 0.0851397 -0.0102494 0.0431465 -0.0225636 -0.0418361 -0.1529228 -0.0501125 -0.0309792 -0.088421 0.0488793 -0.0081197 -0.0069207 0.0054635 0.1085115 0.089269 -0.0140834 -0.0237829 0.0430918 -0.1089031 -0.077666 -0.0001899 -0.1413117 0.0034938 0.085975 -0.0167751 0.0926685 0.0069581 0.0618323 0.0630977 0.0578009 0.0675788 -0.1353014 0.0431689 0.0946036 -0.0829561 0.0799393 0.0127732 0.0759295 -0.067083 0.0539986 0.0245619 -0.166849 -0.0998023 0.0123788 -0.1214783 0.063712 -0.0038697 0.0090353 -0.0297289 0.0739904 0.0963712 -0.010749 0.0202602 0.0312919 -0.1013683 -0.1374593 0.0273881 -0.0690479 -0.0032839 0.0529032 0.0085938 0.0212117 0.0546583 0.118272 0.0163262 0.0351928 -0.0058411 -0.0749283 0.2334759 -0.0097466 -0.0162913 0.1251172 0.028944 0.0373086 -0.0242535 0.0381602 0.1029331 0.2201765 -0.0523945 -0.0908861 -0.0866863 0.3337256 -0.0903994 -0.132663 -0.0900602 0.2463308 unknown
polarizability: 123.7282644|-4.1766773|81.5039006|0.2217181|3.8329906|75.2638611 unknown
InChI: InChI=1S/C7H13NO3/c1-5(2)8-6(9)3-4-7(10)11/h5,8,10H,3-4H2,1-2H3
charge 0 multiplicity 1
24 atoms
O  -0.640449 -1.551455 0.033562
O  4.32072 -0.453667 -0.547839
O  3.451901 0.728702 1.249132
N  -1.697821 0.515803 -0.061908
C  -3.070788 -0.043471 -0.118368
C  0.756562 0.472428 0.180414
C  -0.574443 -0.281195 0.036983
C  -3.996815 0.947005 -0.850816
C  -3.584798 -0.394478 1.297703
C  1.923779 -0.368804 -0.363133
C  3.256498 0.04806 0.216352
H  -2.991462 -0.981998 -0.697885
H  -1.591585 1.532304 -0.030586
H  0.712336 1.459663 -0.316607
H  0.935368 0.667614 1.256134
H  -5.013957 0.525992 -0.932582
H  -4.077442 1.903284 -0.297234
H  -3.629325 1.161046 -1.870424
H  -2.892855 -1.099763 1.7883
H  -4.580393 -0.871355 1.238951
H  -3.672212 0.51305 1.924036
H  1.982387 -0.344753 -1.464872
H  1.737197 -1.42928 -0.095065
H  5.180497 -0.197735 -0.115245
