program: Gaussian 09
title: 000245039
version: EM64L-G09RevD.01
frameworkgroup: C1[X(C20H17NO5)]
method: RPBEPBE
basis: SDD
operation: Freq
keyword: #p
keyword: freq=noraman
keyword: PBEPBE/SDD
title: #p freq=noraman PBEPBE/SDD
converged: YES YES NO NO
title: Mulliken charges:
elementType: O O O O O N C C C C C C C C C C C C C C C C C C C C H H H H H H H H H H H H H H H H H
charge: -0.345083 -0.290323 -0.427610 -0.220408 -0.189875 -0.022752 0.227252 -0.578750 0.131136 0.057439 0.043223 0.111185 0.415762 -0.078416 0.046561 -0.341014 0.251999 -0.289614 -0.317334 -0.372621 -0.388047 -0.330510 -0.245759 -0.221198 -0.524691 -0.530139 0.278368 0.274264 0.286980 0.277670 0.256876 0.245569 0.237219 0.263658 0.231837 0.233527 0.388687 0.233832 0.262830 0.237203 0.253754 0.235797 0.231517
chargesum: 0.00000
title: Mulliken charges with hydrogens summed into heavy atoms:
elementType: O O O O O N C C C C C C C C C C C C C C C C C C C C
charge: -0.345083 -0.290323 -0.038923 -0.220408 -0.189875 -0.022752 0.227252 -0.026119 0.131136 0.057439 0.043223 0.111185 0.415762 -0.078416 0.046561 -0.054034 0.251999 -0.011945 -0.071765 -0.115744 -0.150829 -0.066852 -0.013923 0.012329 0.209175 0.190929
polarizability: 3.25943804e+02 1.93670417e+00 2.63695391e+02 -2.84364870e+01 -2.65954569e+00 1.68902395e+02
1716.lowfreq: -6.5819 -2.6289 -0.0002 0.0005 0.0009 4.7627 8.7362 15.5498 31.7849
frequency: 6.5806 15.3804 31.7703 42.9468 61.8473 85.2392 88.9973 103.5136 112.4298 125.5768 147.6990 156.1889 163.0233 163.2489 180.4159 191.1836 226.3818 245.4199 258.0078 277.3669 317.2600 325.0390 346.7593 360.7226 388.1043 396.4946 397.2272 447.4759 471.9854 482.1216 486.6459 513.7172 515.2388 523.4359 576.9175 589.6752 592.4392 612.6305 621.1964 635.4413 641.9354 667.3970 675.9259 697.7840 753.2672 758.9113 761.0292 790.7055 805.1711 835.2394 840.5471 864.5570 866.7046 893.4277 908.8541 920.2587 930.1371 958.9224 969.4272 987.0945 998.0431 1003.3922 1011.2012 1016.2783 1035.2814 1060.4461 1109.8597 1113.7658 1116.8493 1140.8797 1142.1797 1153.8489 1163.8156 1167.1901 1175.5836 1181.9993 1218.6445 1233.3794 1243.3669 1250.1016 1277.6201 1291.9020 1302.8154 1309.1043 1363.4202 1384.2694 1396.6428 1404.7150 1405.4240 1420.1565 1431.0741 1440.0186 1454.9085 1455.3895 1460.6901 1474.4425 1482.3696 1487.8214 1502.0920 1548.1346 1552.8734 1584.0657 1589.6602 1607.2150 1614.3576 1623.7291 2980.1951 2985.2247 3018.8960 3077.4145 3082.9683 3087.9274 3123.5117 3128.7400 3131.5842 3133.8305 3138.6469 3155.5864 3155.6913 3170.7799 3176.4081 3178.3325 3400.4672
redmass: 5.9945 5.1027 4.6685 6.2621 4.6519 5.7010 7.5343 3.9708 3.7981 3.6373 4.5874 1.2190 1.8373 1.5167 4.2535 3.5713 5.0468 5.8206 7.2241 5.9083 4.8207 5.6576 6.3307 4.1629 5.2445 7.1059 3.7057 3.2935 3.9207 3.9053 4.0666 4.9636 6.6600 5.9720 4.9662 6.4276 5.1003 6.9531 5.4976 3.8123 1.1177 4.7528 4.8141 4.7121 5.5291 3.3996 1.7820 3.3255 3.4755 1.6441 2.2291 4.1240 2.3984 1.7475 7.6553 3.5070 4.5592 7.6250 1.3698 1.3367 1.3329 1.3671 4.6444 2.2190 3.3080 3.0237 1.7030 1.2414 1.2430 1.2077 1.3553 1.3526 1.6860 1.1099 1.2758 2.2874 2.7796 1.9114 2.2058 1.7617 2.0352 2.5529 3.9625 2.0501 3.9571 1.2746 3.3577 2.6294 4.8223 2.2590 1.3289 1.4975 3.1376 1.0579 1.0610 1.1048 2.4304 1.0524 3.7277 7.5879 8.3261 8.8498 6.5116 9.2232 6.9930 6.6831 1.0304 1.0303 1.0595 1.1047 1.0992 1.1044 1.0871 1.1030 1.1042 1.0906 1.0893 1.0948 1.0882 1.0997 1.0966 1.0959 1.0631
irintensity: 0.3421 1.0698 2.6299 1.7981 0.2897 0.7596 1.0769 2.3731 8.8117 2.0734 3.7296 0.6811 3.8718 5.5943 6.6775 5.1459 7.8530 0.4564 8.3399 7.2594 3.1560 16.0289 2.2604 19.1016 1.6507 2.3031 3.9512 3.0055 18.1433 28.7785 1.1557 1.3286 2.4377 14.3400 1.6318 10.3903 3.9728 3.7885 7.3738 6.3934 121.9351 7.3364 28.7640 0.5649 3.7397 8.2866 26.8975 35.1754 2.6034 34.0992 26.9167 10.2067 23.1324 10.7524 41.4190 2.6493 3.7347 119.0030 4.2593 3.4629 0.1286 0.1922 29.1457 3.0708 155.3452 76.5126 45.6912 12.4850 8.6496 1.8164 2.5993 1.3415 34.3005 1.2848 7.9101 37.4417 214.5777 16.7993 91.9147 7.1173 135.9605 1.8611 91.4167 220.6673 6.6530 100.7121 150.6589 25.5956 10.1722 7.1650 2.2782 23.2950 20.1642 16.6089 2.9020 6.7264 9.6347 22.8423 4.6878 21.2548 184.1207 81.8312 28.6200 205.1296 82.0552 7.4680 68.1157 55.6904 6.2265 24.4077 2.4205 20.3245 2.8439 21.7924 16.5172 9.9768 12.9296 25.2192 1.3542 21.9808 6.5706 5.1098 97.9014
temp: 298.150 k
press: 1.00000 atm
elementType: 8 8 8 8 8 7 6 6 6 6 6 6 6 6 6 6 6 6 6 6 6 6 6 6 6 6 1 1 1 1 1 1 1 1 1 1 1 1 1 1 1 1 1
symmnumber: 1
zpe: 851371.9 jmol-1
zpe.correction: 0.324270 hartree
zpe.thermalcorrener: 0.347920 hartree
zpe.thermalcorrenthalpy: 0.348864 hartree
zpe.thermalcorrgfe: 0.267886 hartree
zpe.sumelectzpe: -1201.324945 hartree
zpe.sumelectthermal: -1201.301296 hartree
zpe.sumelectthermalent: -1201.300352 hartree
zpe.sumelectthermalfe: -1201.381330 hartree
dipole: 3.0302 4.6796 -2.8386
dipole: 6.2561
quadrupole: -96.9435 -149.9341 -152.7505
quadrupole: -7.2167 -12.9858 2.0097
quadrupole: 36.2659 -16.7247 -19.5412 -7.2167 -12.9858 2.0097
hfenergy: -1201.6492158 hartree
pointgroup: C01 [X(C20H17N1O5)]
dipole: -1.0170514 -2.1736798 -0.5467212 debye
polarizability: 324.1128387|15.3223116|259.7100163|27.8309476|-21.1875703|174.7187348 unknown
InChI: InChI=1S/C20H17NO5/c1-25-18-10-8-13(19(24)20(18)26-2)16(22)11-17(23)15-9-7-12-5-3-4-6-14(12)21-15/h3-10,24H,11H2,1-2H3
charge 0 multiplicity 1
43 atoms
O  -4.604518 -0.892374 -1.488666
O  -5.437847 -1.570544 1.279409
O  -2.316672 0.388156 -1.912708
O  0.119861 1.66222 1.403363
O  1.529402 3.52246 -1.178008
N  2.459127 0.117114 -0.541387
C  -1.804345 0.551217 0.499007
C  0.060911 1.581143 -1.027171
C  -0.503305 1.285394 0.365256
C  2.612004 1.460094 -0.570979
C  -2.634133 0.131587 -0.577518
C  1.406798 2.28828 -0.940324
C  4.851165 -0.071411 0.10449
C  3.560274 -0.655941 -0.210265
C  -3.854845 -0.554842 -0.325056
C  -2.250914 0.254539 1.821203
C  -4.242996 -0.884314 0.993431
C  3.851371 2.12423 -0.279583
C  4.962927 1.358364 0.058942
C  -3.436699 -0.449259 2.074989
C  5.942845 -0.933231 0.441246
C  3.409705 -2.079926 -0.178141
C  5.767706 -2.319532 0.465487
C  4.493628 -2.895745 0.154009
C  -5.935328 -0.227797 -1.567436
C  -5.571061 -2.913636 0.661558
H  0.157814 0.626182 -1.57405
H  -0.651296 2.211834 -1.587766
H  -1.608366 0.590992 2.641002
H  3.876508 3.215765 -0.330453
H  -3.757276 -0.690284 3.092249
H  5.923093 1.832094 0.29412
H  6.917793 -0.491275 0.679707
H  2.425006 -2.493154 -0.417188
H  6.606696 -2.974833 0.724092
H  4.374204 -3.984326 0.179403
H  -3.041075 -0.029653 -2.462903
H  -5.812284 0.870515 -1.590403
H  -6.555801 -0.516419 -0.701751
H  -6.386609 -0.584233 -2.505366
H  -5.467742 -2.863557 -0.436894
H  -6.57625 -3.261281 0.942389
H  -4.805575 -3.593511 1.078766
