program: Gaussian 09
title: 000245006
version: EM64L-G09RevD.01
frameworkgroup: C1[X(C22H33NO2)]
method: RPBEPBE
basis: SDD
operation: Freq
keyword: #p
keyword: freq=noraman
keyword: PBEPBE/SDD
title: #p freq=noraman PBEPBE/SDD
converged: YES YES NO NO
title: Mulliken charges:
elementType: O O N C C C C C C C C C C C C C C C C C C C C C C H H H H H H H H H H H H H H H H H H H H H H H H H H H H H H H H H
charge: -0.287573 -0.436085 -0.092691 0.296809 -0.123908 -0.104940 0.342442 0.332440 -0.557063 -0.519698 -0.518381 -0.509988 -0.553125 -0.553604 -0.155357 -0.343929 -0.398980 -0.490254 -0.421475 -0.466154 0.687061 -0.796399 -0.454331 -0.312947 -0.818608 0.230125 0.184407 0.255146 0.214487 0.161705 0.204816 0.215915 0.214634 0.216538 0.197560 0.242062 0.211113 0.219133 0.219523 0.219657 0.223511 0.206819 0.200954 0.202711 0.184915 0.244018 0.226270 0.211866 0.203244 0.205668 0.260247 0.232285 0.243005 0.211059 0.199512 0.329441 0.239429 0.224964
chargesum: 0.00000
title: Mulliken charges with hydrogens summed into heavy atoms:
elementType: O O N C C C C C C C C C C C C C C C C C C C C C C
charge: -0.287573 -0.106645 -0.092691 0.296809 0.106217 0.079466 0.342442 0.332440 -0.087430 -0.153177 -0.087831 -0.095890 -0.099950 -0.114947 0.064300 -0.120418 -0.192161 -0.086589 0.007457 -0.028018 0.687061 -0.127240 0.020959 0.097624 -0.354215
polarizability: 2.74759679e+02 4.80477327e-01 2.14931122e+02 7.15969511e+00 1.82757148e+00 2.06005720e+02
1716.lowfreq: -15.9253 0.0001 0.0007 0.0008 9.4350 17.4592 41.5768 59.1906 71.3673
frequency: 41.4925 59.0743 71.3217 91.2834 121.1700 143.0367 145.2929 180.3350 183.8731 207.2217 223.9095 238.0625 245.4820 271.1436 271.2779 282.5625 292.8932 295.8491 302.1291 317.9208 332.8661 336.4459 351.4840 382.3907 395.3263 414.3525 439.3667 452.5488 459.0640 485.5441 500.7798 506.0826 521.3956 527.0951 564.4187 571.6530 621.5974 656.1856 665.2447 674.2690 712.6579 722.3650 757.3163 771.2645 778.2031 808.2347 812.3900 815.7336 826.7617 844.7504 851.0235 861.0812 861.3737 893.8650 898.5196 902.8659 913.1064 930.7626 932.8295 944.3099 946.0173 962.1219 965.9219 972.0950 983.5239 987.9007 1009.6740 1019.5679 1027.5659 1038.7756 1048.6900 1057.9533 1068.1990 1076.6013 1083.0044 1084.0175 1097.3234 1099.0117 1105.3699 1132.9370 1140.7282 1143.9583 1149.3060 1159.5293 1168.4941 1173.0026 1175.7424 1191.4376 1199.1584 1210.7027 1214.2109 1221.7199 1227.8018 1236.3579 1253.0277 1257.4052 1276.3582 1279.3446 1282.3952 1287.4579 1297.0235 1300.2773 1308.5690 1312.0203 1313.1662 1317.0621 1322.4776 1328.2530 1330.3422 1334.4243 1337.6126 1342.0535 1344.5532 1349.6894 1356.4395 1362.5194 1371.2034 1379.5274 1390.1168 1391.1807 1431.1609 1457.3930 1460.0058 1461.4098 1464.5655 1466.6605 1468.0523 1471.0127 1474.4577 1480.1845 1486.3868 1491.0902 1494.6641 1497.7123 1676.6620 2912.6528 2913.4093 2930.9003 2941.1938 2945.6321 2953.9634 2957.3013 2958.5900 2965.5024 2974.6473 2983.3891 2984.0788 2987.5133 2988.5639 2988.6794 3008.6726 3010.5985 3013.9608 3014.8843 3020.0013 3023.5229 3039.7487 3040.3474 3048.7315 3056.9480 3058.8372 3062.5902 3066.9140 3089.4333 3090.1579 3104.9276 3194.2231 3541.3628
redmass: 3.7951 2.9552 3.4581 3.4411 4.5132 2.4824 3.7963 2.6574 3.0860 3.3455 2.3217 2.3719 1.8080 2.0895 2.7363 1.9821 2.7115 2.4865 2.0859 1.2832 2.8621 2.6789 2.0650 3.2555 2.5444 3.5002 3.2443 2.9698 3.2653 3.2568 3.2173 4.7120 3.4939 3.9914 2.2290 2.5065 3.4225 3.9726 3.1959 4.4160 2.1886 1.5950 2.6253 4.0189 2.4963 2.5864 1.6712 1.7825 2.5808 2.0736 1.7659 2.5584 2.2418 2.9689 2.6120 2.8392 2.1006 2.0563 2.3908 3.1914 1.4136 1.9318 2.4035 1.8480 2.0596 3.3473 2.3829 2.0989 2.1342 1.9614 2.8483 2.3661 2.3674 2.0351 2.1953 2.0258 1.8470 1.9799 2.1550 2.5493 1.5685 1.5115 1.5252 2.0289 1.6167 1.7083 1.3964 1.2938 1.7681 1.6245 1.6414 1.6511 1.5488 1.4517 1.2827 1.4021 1.3371 1.4764 1.7037 1.5404 1.3009 1.4482 1.3129 1.4185 1.3300 1.6026 1.3946 1.4823 1.4339 1.3918 1.4392 1.4893 1.3488 1.4132 1.3375 1.6312 1.4131 1.3660 1.3056 1.3925 1.1949 1.0748 1.0805 1.0887 1.0809 1.0814 1.0871 1.0788 1.0942 1.0780 1.0798 1.0755 1.0714 1.0882 6.0383 1.0825 1.0832 1.0610 1.0824 1.0657 1.0668 1.0606 1.0763 1.0693 1.0382 1.0638 1.0566 1.0632 1.0667 1.0901 1.0673 1.0692 1.0983 1.0970 1.0919 1.0886 1.1056 1.0965 1.1000 1.0996 1.0982 1.0973 1.0970 1.0624 1.1041 1.0971 1.1139 1.0655
irintensity: 0.3517 2.1216 0.0650 0.8834 6.7452 0.2394 0.7850 0.5624 1.9388 4.3229 2.3925 6.8097 11.4667 0.9853 4.4407 8.4619 7.6154 38.2732 5.4614 119.5416 0.3608 3.1988 0.2008 1.1796 2.9353 0.7983 4.8880 5.3041 6.5975 3.8824 1.0493 1.9830 2.5296 2.5305 0.3663 3.0045 3.5482 5.0526 3.7215 3.1582 6.5862 6.8813 6.2589 61.3960 33.3768 2.6112 12.3956 3.5901 4.4723 3.0090 3.9772 4.4408 1.0529 0.0476 2.4423 2.3011 3.9103 7.1489 2.3338 32.9195 67.2088 27.0959 11.3462 1.6625 10.1057 27.8645 5.1165 17.6588 6.9920 12.3446 7.9979 9.3526 15.3574 5.8352 0.4082 8.5888 3.6177 3.4996 0.8906 0.6878 6.0976 5.0098 3.1681 1.2615 9.0479 0.9201 21.2324 12.6267 10.5294 2.2335 1.9664 12.0506 0.2148 5.1532 11.9871 1.8940 1.2665 2.4574 0.9173 1.0106 6.8404 1.1491 2.4239 2.0650 0.3886 3.0520 2.0412 3.0608 2.2210 2.2056 0.8544 3.3705 5.4291 5.8514 0.8475 7.3839 6.4403 8.5883 8.0179 6.0740 17.3076 6.7058 7.3061 7.3034 0.5868 2.2799 8.3251 14.0588 21.2207 5.7323 2.4329 20.4134 2.5567 11.0685 12.0597 20.3977 38.7198 61.3434 83.9152 25.5339 31.3435 42.2738 17.4914 35.9835 52.8022 20.9424 92.0623 47.0619 77.8911 19.6843 40.5135 49.7214 39.0696 6.2299 2.4894 117.0158 58.1227 34.6289 14.7024 70.1064 15.8404 57.4672 44.3975 12.5100 31.0025 15.4656 13.3075 4.4244
temp: 298.150 k
press: 1.00000 atm
elementType: 8 8 7 6 6 6 6 6 6 6 6 6 6 6 6 6 6 6 6 6 6 6 6 6 6 1 1 1 1 1 1 1 1 1 1 1 1 1 1 1 1 1 1 1 1 1 1 1 1 1 1 1 1 1 1 1 1 1
symmnumber: 1
zpe: 1343640.0 jmol-1
zpe.correction: 0.511765 hartree
zpe.thermalcorrener: 0.533539 hartree
zpe.thermalcorrenthalpy: 0.534483 hartree
zpe.thermalcorrgfe: 0.464238 hartree
zpe.sumelectzpe: -1061.352538 hartree
zpe.sumelectthermal: -1061.330764 hartree
zpe.sumelectthermalent: -1061.329820 hartree
zpe.sumelectthermalfe: -1061.400065 hartree
dipole: -0.6744 1.6522 -0.1914
dipole: 1.7948
quadrupole: -160.2838 -145.1502 -152.7285
quadrupole: 1.6213 -6.9497 5.1202
quadrupole: -7.5630 7.5706 -0.0076 1.6213 -6.9497 5.1202
hfenergy: -1061.8643032 hartree
pointgroup: C01 [X(C22H33N1O2)]
dipole: 0.2573449 0.6554209 0.0528257 debye
polarizability: 274.6036316|0.5023856|214.7804337|7.8907049|-2.0784063|206.3124554 unknown
InChI: InChI=1S/C22H33NO2/c1-14-15-4-8-21(18(14)24)9-5-16-20(2)6-3-7-22(16,17(21)12-15)13-23-10-11-25-19(20)23/h15-19,24H,1,3-13H2,2H3
charge 0 multiplicity 1
58 atoms
O  3.179198 1.163246 1.332878
O  -3.433904 -1.98159 0.802782
N  2.415677 1.075228 -0.920066
C  0.371724 -0.44092 -0.684338
C  -1.195147 -0.468721 -0.510046
C  1.049272 -1.10131 0.565131
C  -1.776951 -0.027938 0.879266
C  2.602158 -1.118034 0.367095
C  0.5510 -0.486755 1.895466
C  -0.975371 -0.669832 2.035989
C  0.922987 1.00476 -0.843967
C  0.701472 -1.31686 -1.93964
C  -1.997145 0.233761 -1.66307
C  -1.891532 1.516598 1.063157
C  3.149789 0.29352 0.068814
C  -3.180823 1.059488 -1.076334
C  -3.272201 -0.514963 0.91301
C  2.912982 -2.03609 -0.861588
C  2.20473 -1.60554 -2.166441
C  -2.587145 2.174975 -0.168901
C  -4.042792 0.122126 -0.245859
C  3.343294 -1.690834 1.599609
C  2.941597 2.452191 -0.710582
C  3.144999 2.561672 0.846111
C  -5.338677 -0.170314 -0.507538
H  -1.45034 -1.549412 -0.556217
H  0.730798 -2.170124 0.571552
H  0.838321 0.577305 1.96588
H  1.049345 -0.987907 2.745363
H  -1.177015 -1.764014 2.061433
H  -1.324263 -0.255147 3.004844
H  0.544661 1.449185 -1.782784
H  0.547517 1.634908 -0.009937
H  0.276851 -0.843125 -2.846776
H  0.167372 -2.282078 -1.811181
H  -2.386484 -0.519378 -2.371067
H  -1.357302 0.920821 -2.248537
H  -0.904318 1.969174 1.256376
H  -2.48947 1.702592 1.979188
H  4.208448 0.215858 -0.261999
H  -3.77476 1.504751 -1.896172
H  -3.702922 -0.183664 1.886825
H  2.597667 -3.064175 -0.586386
H  4.009117 -2.076109 -1.024245
H  2.312075 -2.406677 -2.924946
H  2.694886 -0.702428 -2.56768
H  -3.384359 2.868089 0.156512
H  -1.863448 2.767507 -0.762145
H  2.91923 -2.674363 1.878249
H  4.415989 -1.838906 1.370263
H  3.278713 -1.013162 2.465193
H  2.243545 3.203243 -1.114425
H  3.910767 2.556386 -1.231135
H  4.093617 3.070718 1.100577
H  2.307275 3.079562 1.350438
H  -3.087596 -2.395454 1.634741
H  -5.892692 -0.895455 0.098521
H  -5.868412 0.285016 -1.352961
