program: Gaussian 09
title: 000244996
version: EM64L-G09RevD.01
frameworkgroup: C1[X(C21H23N5S)]
method: RPBEPBE
basis: SDD
operation: Freq
keyword: #p
keyword: freq=noraman
keyword: PBEPBE/SDD
title: #p freq=noraman PBEPBE/SDD
converged: YES YES NO NO
title: Mulliken charges:
elementType: S N N N N N C C C C C C C C C C C C C C C C C C C C C H H H H H H H H H H H H H H H H H H H H H H H
charge: 0.270348 -0.171399 -0.049715 -0.072363 -0.056910 -0.591766 -0.027042 -0.420560 0.180229 -0.687628 -0.705616 0.098045 0.261187 -0.244396 0.194789 -0.883779 -0.354262 0.310070 0.430839 -0.439505 -0.468639 -0.375770 -0.056790 -0.844440 -0.437092 -0.262740 -0.246604 0.201654 0.220461 0.248209 0.212659 0.222730 0.227916 0.223461 0.205915 0.233765 0.273970 0.292604 0.313818 0.230741 0.236288 0.246885 0.232479 0.230796 0.250939 0.238026 0.225723 0.227326 0.326731 0.328416
chargesum: 0.00000
title: Mulliken charges with hydrogens summed into heavy atoms:
elementType: S N N N N N C C C C C C C C C C C C C C C C C C C C C
charge: 0.270348 -0.171399 -0.049715 -0.072363 -0.056910 0.063381 0.174612 0.048109 0.180229 -0.024323 -0.042475 0.098045 0.261187 0.029575 0.194789 -0.277357 -0.354262 0.310070 0.430839 -0.208764 -0.232351 -0.128885 -0.056790 -0.130227 -0.199067 -0.037017 -0.019278
polarizability: 4.25718229e+02 -1.22781418e+01 2.68715639e+02 3.05504067e+00 3.36721275e+00 2.23564202e+02
1716.lowfreq: -17.0309 -10.4712 -2.6356 -0.0006 0.0005 0.0007 4.0266 11.4898 26.6514
frequency: -12.9728 8.2015 25.8685 33.3295 38.2157 61.7727 71.0780 88.4576 109.4246 121.1950 135.4175 161.0236 164.4531 171.9086 194.9920 208.4682 212.5015 238.7632 243.8169 281.2194 286.1614 310.7879 331.6599 349.1068 354.2409 368.0677 373.1737 414.2378 420.3425 428.2437 431.3531 463.8238 467.7517 507.2656 507.8546 511.5417 516.6192 531.2629 581.4597 586.3955 591.8835 618.9889 639.6262 651.0309 680.1311 708.1513 709.1923 719.2184 722.9273 754.2226 780.9246 782.3552 803.1631 804.5382 817.3586 828.0649 838.7540 857.1565 877.9623 886.0187 892.6613 926.1322 949.8448 954.5043 955.0193 961.3078 967.5237 974.9937 990.4105 1008.4517 1034.9485 1035.8191 1043.7372 1074.4859 1080.4509 1090.0069 1127.3475 1135.0604 1157.6384 1174.7794 1181.7056 1193.7461 1198.6668 1205.1428 1236.8183 1240.8304 1248.8219 1277.3024 1283.7892 1291.6778 1302.6953 1317.3546 1329.3362 1348.8659 1358.8915 1366.8737 1375.4383 1382.8147 1397.1019 1401.5664 1407.2441 1412.6727 1429.0792 1432.6890 1450.8508 1460.5610 1462.3618 1468.1310 1473.2154 1476.3724 1479.4858 1489.3825 1491.3269 1497.2479 1518.4939 1519.7407 1568.1090 1578.1057 1602.4938 1604.7146 1632.1773 2965.3380 2971.2118 2971.2956 2981.2590 3004.0872 3048.9781 3063.0419 3064.7793 3068.9527 3071.8286 3077.9523 3084.2781 3085.4851 3117.2520 3120.2673 3131.1840 3133.0732 3142.3966 3150.5443 3164.7604 3233.7021 3567.5739 3726.7771
redmass: 4.1937 4.5022 3.6185 5.2941 4.7307 3.4339 5.7684 4.2797 4.4376 5.5673 4.7592 5.1345 1.4781 1.6511 3.9411 2.9918 1.4925 2.3722 1.3888 4.8776 3.4795 3.9219 3.2621 2.5130 3.4094 2.5692 2.5257 4.8055 4.0724 4.4950 1.2213 3.7209 3.3937 2.8058 1.2790 3.2330 5.7350 4.1578 4.4529 5.1142 8.0305 4.5412 4.4166 5.5813 5.1713 4.5511 7.6563 5.5200 4.5463 1.3132 5.4590 4.6085 4.3132 2.6165 1.5616 1.3440 2.2225 4.2614 5.7332 1.9099 1.6594 1.2354 1.9899 2.8485 1.3472 2.0044 2.0312 1.3874 1.3491 1.8566 2.1064 2.2628 1.5710 2.6082 2.4409 1.6411 3.3125 1.1899 1.3078 1.1512 1.9538 1.5598 2.0550 1.9939 1.6067 1.3458 2.8865 1.7292 2.9831 1.7220 3.3822 2.1932 3.0953 1.8420 2.8257 1.3781 5.9936 1.2275 1.2760 1.2286 3.4138 3.0436 3.4202 3.0757 1.3219 1.2557 1.0488 2.0698 1.0664 1.0597 1.0659 1.0878 1.0615 2.8402 7.3638 3.5559 9.7225 7.2302 5.9609 1.5132 6.6892 1.0806 1.0384 1.0374 1.0360 1.0616 1.0958 1.0595 1.1004 1.1026 1.1000 1.0991 1.0986 1.0999 1.0864 1.0861 1.0991 1.0954 1.0976 1.0943 1.0996 1.0978 1.0440 1.1059
irintensity: 0.2675 0.1254 0.0513 0.6819 1.1240 0.1006 0.4244 0.4118 2.1020 0.1366 0.3439 5.9310 1.2491 0.1275 0.4400 0.2784 0.4216 1.9754 0.5587 1.5598 2.0771 7.2243 6.2019 0.0776 1.2159 4.6892 0.2996 1.5101 2.5556 3.1760 275.5275 0.7699 6.3089 0.7772 0.4752 0.1147 9.1591 9.6802 2.9561 26.0928 3.6753 12.2161 3.4562 9.5745 8.4510 5.0151 10.3920 12.1755 3.6667 31.2055 16.8581 17.8811 2.9781 11.5901 11.3560 57.4116 0.9575 8.8318 118.3663 10.9667 24.7979 0.9773 6.9083 7.8367 0.6154 4.0880 5.0485 3.2871 0.7173 1.4987 6.5256 4.3929 8.9145 0.5824 32.8624 32.5390 47.9468 3.2783 0.8865 3.5402 4.0830 2.5402 8.4661 53.8770 14.9385 18.1160 4.1078 2.6185 48.1183 9.9711 63.5828 12.8160 17.3174 28.2235 2.6304 18.9236 94.3167 26.3638 7.6803 18.1907 5.5641 3.2452 6.7253 59.0098 38.1902 28.9868 5.8575 5.0792 15.7712 2.0223 30.3993 6.2851 26.8451 213.0536 329.9582 39.9120 221.8614 0.8004 4.8302 412.7241 4.1296 26.7588 26.9723 27.2912 18.7214 59.7808 15.4740 3.8716 21.6599 18.4809 6.1915 116.6857 22.6140 29.0093 4.9774 2.8407 5.0460 3.6227 39.1898 42.4988 26.0724 0.2152 111.8524 43.3097
temp: 298.150 k
press: 1.00000 atm
elementType: 16 7 7 7 7 7 6 6 6 6 6 6 6 6 6 6 6 6 6 6 6 6 6 6 6 6 6 1 1 1 1 1 1 1 1 1 1 1 1 1 1 1 1 1 1 1 1 1 1 1
symmnumber: 1
zpe: 1054257.9 jmol-1
zpe.correction: 0.401546 hartree
zpe.thermalcorrener: 0.425967 hartree
zpe.thermalcorrenthalpy: 0.426911 hartree
zpe.thermalcorrgfe: 0.345507 hartree
zpe.sumelectzpe: -1483.960378 hartree
zpe.sumelectthermal: -1483.935957 hartree
zpe.sumelectthermalent: -1483.935013 hartree
zpe.sumelectthermalfe: -1484.016417 hartree
dipole: 3.1462 -1.8441 2.3840
dipole: 4.3569
quadrupole: -127.3987 -156.4495 -163.2785
quadrupole: 1.1814 1.2756 -0.0211
quadrupole: 21.6435 -7.4073 -14.2363 1.1814 1.2756 -0.0211
hfenergy: -1484.3619239 hartree
pointgroup: C01 [X(C21H23N5S1)]
dipole: 1.2509559 -0.556807 1.0311763 debye
polarizability: 426.0961577|-9.0801016|268.3589194|4.1781686|-3.3301773|223.5429926 unknown
InChI: InChI=1S/C21H23N5S/c1-13(2)10-26-12-23-18-19(26)24-21(22)25-20(18)27-11-17-14(3)8-9-15-6-4-5-7-16(15)17/h4-9,12-13H,10-11,22H2,1-3H3
charge 0 multiplicity 1
50 atoms
S  -0.610566 -0.024857 -0.767254
N  4.439462 -0.105754 -0.877165
N  2.47798 0.411203 -1.971306
N  3.504752 -1.010129 1.226796
N  1.03976 -0.953176 1.238439
N  2.253984 -1.802705 3.050377
C  6.592313 1.029614 -0.115642
C  5.880795 -0.26402 -0.606053
C  3.403329 -0.454764 -0.008369
C  5.953189 1.578822 1.180452
C  6.661438 2.116677 -1.21329
C  2.194213 -0.125399 -0.700331
C  -3.211086 -0.647514 0.122613
C  3.819169 0.404276 -2.037326
C  -4.029033 0.543641 0.223244
C  -1.789161 -0.637919 0.624233
C  0.99025 -0.402659 -0.001234
C  -3.747841 -1.830191 -0.4342
C  -5.413687 0.495752 -0.20496
C  -5.116597 -1.848906 -0.860032
C  -5.932684 -0.725732 -0.740902
C  -3.523409 1.792825 0.722344
C  2.276396 -1.236077 1.794122
C  -2.910862 -3.088669 -0.595801
C  -6.233549 1.667175 -0.093947
C  -4.343062 2.920831 0.813788
C  -5.713616 2.86017 0.409541
H  7.630888 0.710356 0.116539
H  6.366539 -0.633504 -1.528884
H  5.966398 -1.047733 0.167971
H  6.548713 2.420253 1.579179
H  4.930122 1.95073 0.98772
H  5.881837 0.798254 1.958768
H  7.247973 2.984474 -0.860781
H  7.140799 1.736983 -2.135856
H  5.651736 2.484612 -1.473516
H  4.399406 0.738111 -2.894812
H  -1.62931 0.027829 1.484287
H  -1.421813 -1.636235 0.897274
H  -5.519459 -2.775378 -1.285867
H  -6.979251 -0.762126 -1.066478
H  -2.471918 1.875239 1.014299
H  -2.659624 -3.543885 0.382116
H  -3.45519 -3.847482 -1.182924
H  -1.956452 -2.878355 -1.11292
H  -7.279731 1.609117 -0.418202
H  -3.932502 3.864051 1.191169
H  -6.345002 3.751875 0.489098
H  3.131304 -2.030874 3.508424
H  1.358968 -1.976127 3.497663
