program: Gaussian 09
title: 000244993
version: EM64L-G09RevD.01
frameworkgroup: C1[X(C11H20O6S2)]
method: RPBEPBE
basis: SDD
operation: Freq
keyword: #p
keyword: freq=noraman
keyword: PBEPBE/SDD
title: #p freq=noraman PBEPBE/SDD
converged: YES YES NO NO
title: Mulliken charges:
elementType: S S O O O O O O C C C C C C C C C C C H H H H H H H H H H H H H H H H H H H H
charge: 1.058502 1.083283 -0.412037 -0.398651 -0.566725 -0.503736 -0.580556 -0.497164 -0.196068 -0.146680 -0.096651 -0.068765 -0.523352 -0.482221 -0.472606 -0.388625 -0.453668 -0.760130 -0.761674 0.237944 0.253293 0.232338 0.275181 0.230141 0.229619 0.211920 0.231697 0.226856 0.215001 0.239517 0.239265 0.276576 0.235124 0.287875 0.274629 0.362005 0.286019 0.278885 0.343640
chargesum: 0.00000
title: Mulliken charges with hydrogens summed into heavy atoms:
elementType: S S O O O O O O C C C C C C C C C C C
charge: 1.058502 1.083283 -0.412037 -0.398651 -0.566725 -0.503736 -0.580556 -0.497164 0.041876 0.106612 0.135687 0.206416 -0.063592 -0.038604 -0.030749 0.090158 0.058032 0.164379 0.146869
polarizability: 2.20643455e+02 -4.93415526e-01 1.97184906e+02 4.19433785e+00 -3.50557661e+00 1.50395560e+02
1716.lowfreq: -8.7678 -1.2437 0.0018 0.0019 0.0024 10.8079 37.6370 41.0305 62.9913
frequency: 37.5427 40.7369 62.9273 65.0659 78.6969 88.9489 100.2982 122.5894 146.4916 151.4064 176.2288 186.0132 194.4396 209.1399 227.0167 231.8019 241.8580 256.3149 279.0113 283.8849 303.3722 312.6758 343.1609 346.3282 360.4989 396.7615 422.2880 441.2745 458.2631 487.8927 509.6668 543.2121 573.7041 591.0708 604.2403 738.0512 742.7600 799.3838 811.0215 825.2480 834.0781 854.5539 879.0827 888.0454 904.8074 906.7218 916.8105 925.2427 926.5982 950.9350 960.6380 978.7192 993.3924 1004.0276 1010.6949 1018.6785 1046.2718 1055.8923 1057.8983 1065.7484 1095.5167 1114.2644 1126.7210 1149.8508 1161.6510 1182.9999 1199.4745 1205.8731 1228.2881 1237.8139 1261.6170 1277.9734 1281.7296 1292.3186 1302.3456 1312.4221 1329.6530 1333.4874 1336.1850 1343.6004 1350.2086 1371.2876 1416.6489 1418.4484 1434.1495 1439.0404 1453.3718 1462.2396 1472.1661 1479.4823 1498.6926 2973.9455 2980.2696 2982.6564 2994.2282 2997.2389 2998.2454 3006.7531 3007.0543 3014.8216 3041.9025 3046.3073 3052.2322 3055.4427 3071.9126 3074.7425 3078.4176 3148.1033 3153.9629 3184.0347 3189.4280
redmass: 4.5028 4.8362 7.4614 6.8432 4.1102 6.4453 8.0651 6.0287 4.4089 5.2995 4.5452 3.0845 3.5651 2.8372 1.2365 2.7420 1.4051 3.1728 2.5197 4.9424 3.3482 5.0597 8.7968 8.9698 5.8646 4.4488 4.0993 2.8531 2.5138 5.0118 3.4088 4.4366 3.6174 9.1407 9.3031 3.7067 3.5832 1.9391 1.7934 9.0998 11.9683 2.5847 3.8679 3.3943 2.3948 4.4293 4.4682 2.9831 3.8056 2.0046 1.6848 1.8394 1.4694 1.4409 1.3193 1.5566 2.1673 1.7733 1.6167 1.6191 1.7315 1.9695 1.3423 1.3597 1.9905 1.5334 1.1892 1.2295 1.2795 1.4447 1.3450 1.4306 1.4455 1.3753 1.4371 1.5138 1.1348 1.1309 1.2637 1.2775 1.3718 1.3907 1.0432 1.0432 1.0535 1.0526 1.0805 1.0733 1.0882 1.0872 1.0914 1.0588 1.0611 1.0835 1.0808 1.0597 1.0295 1.0585 1.0277 1.0630 1.1036 1.0931 1.1007 1.1037 1.1024 1.0945 1.1037 1.1042 1.1071 1.1072 1.1074
irintensity: 2.2583 0.3267 0.7932 0.6192 1.9348 4.1573 20.2196 0.7057 5.1510 11.4158 1.5282 2.6094 1.6626 1.4287 0.4612 5.6022 2.4526 1.8122 2.4945 2.0574 5.7409 10.6536 28.6034 11.7522 33.7631 11.5539 1.8592 38.3295 1.7301 31.9845 26.3464 48.1418 9.5463 30.9596 57.5433 1.6543 3.4042 0.2226 20.6951 31.2733 76.7158 29.6145 16.7687 9.9413 27.7024 125.8348 64.2869 3.2226 68.7533 2.9721 0.0878 6.2144 18.1291 7.4153 27.2141 6.8082 3.1299 43.0929 108.6878 7.1906 2.4281 3.3790 1.1068 2.2292 7.1142 0.6402 0.5763 4.1402 6.4778 6.8923 1.7941 0.2453 0.5407 5.1818 1.0759 1.8372 5.8108 13.8378 13.0198 9.1141 0.4562 5.5543 3.9226 4.2708 16.9529 10.9129 6.5386 12.2756 11.6613 14.8897 12.2976 8.7925 20.1164 4.2799 22.0889 35.7234 44.3722 29.8657 43.4929 59.0710 15.3542 35.9729 9.3058 49.9450 17.5413 19.1383 92.0196 29.5966 30.0398 1.1449 0.8169
temp: 298.150 k
press: 1.00000 atm
elementType: 16 16 8 8 8 8 8 8 6 6 6 6 6 6 6 6 6 6 6 1 1 1 1 1 1 1 1 1 1 1 1 1 1 1 1 1 1 1 1
symmnumber: 1
zpe: 805035.0 jmol-1
zpe.correction: 0.306622 hartree
zpe.thermalcorrener: 0.328084 hartree
zpe.thermalcorrenthalpy: 0.329029 hartree
zpe.thermalcorrgfe: 0.256513 hartree
zpe.sumelectzpe: -1676.758345 hartree
zpe.sumelectthermal: -1676.736883 hartree
zpe.sumelectthermalent: -1676.735938 hartree
zpe.sumelectthermalfe: -1676.808454 hartree
dipole: -1.8041 1.3766 0.4004
dipole: 2.3044
quadrupole: -116.4042 -154.4594 -128.7651
quadrupole: 8.8194 5.5303 -13.8185
quadrupole: 16.8054 -21.2499 4.4445 8.8194 5.5303 -13.8185
hfenergy: -1677.064967 hartree
pointgroup: C01 [X(C11H20O6S2)]
dipole: 0.6128669 0.6418894 0.1852371 debye
polarizability: 198.0764326|4.1910383|219.2748303|1.1506326|-8.0135845|150.8726588 unknown
InChI: InChI=1S/C11H20O6S2/c1-18(12,13)16-6-10-8-3-4-9(5-8)11(10)7-17-19(2,14)15/h8-11H,3-7H2,1-2H3
charge 0 multiplicity 1
39 atoms
S  2.064358 -1.937647 0.655717
S  -2.541218 -2.27875 -0.167266
O  1.932108 -0.62947 -0.663838
O  -2.511271 -0.397426 -0.186548
O  0.813147 -1.78111 1.686055
O  3.556035 -1.9574 1.279832
O  -1.240387 -2.831563 -0.980228
O  -4.019601 -2.752148 -0.598186
C  0.842791 3.049314 -0.130106
C  -1.139872 2.269931 0.693824
C  0.817065 1.558885 -0.614737
C  -0.499819 0.99853 0.050064
C  0.135938 2.962773 1.256545
C  -0.216631 3.832603 -0.963021
C  -1.582734 3.286214 -0.40097
C  2.071132 0.778561 -0.192484
C  -1.362401 0.191193 -0.923693
C  1.769523 -3.367384 -0.546521
C  -2.279943 -2.546167 1.69214
H  1.84707 3.507069 -0.143842
H  -1.929022 2.029703 1.423942
H  0.753997 1.524046 -1.720477
H  -0.215557 0.308373 0.870195
H  0.674742 2.347827 1.999874
H  -0.063717 3.956823 1.695022
H  -0.099554 3.657846 -2.048085
H  -0.11985 4.919886 -0.789906
H  -2.177726 4.097892 0.05522
H  -2.214857 2.827108 -1.180747
H  2.203653 0.804554 0.90748
H  2.988381 1.173632 -0.666747
H  -0.760709 -0.620349 -1.381546
H  -1.799697 0.802838 -1.734436
H  2.506945 -3.236918 -1.348886
H  1.9346 -4.283647 0.037576
H  0.725492 -3.249552 -0.879684
H  -3.04298 -1.931229 2.187443
H  -2.42523 -3.621916 1.866616
H  -1.249301 -2.212125 1.890005
