program: Gaussian 09
title: 000244980
version: EM64L-G09RevD.01
frameworkgroup: C1[X(C20H18O5)]
method: RPBEPBE
basis: SDD
operation: Freq
keyword: #pfreq=noraman
keyword: PBEPBE/SDD
title: #p freq=noraman PBEPBE/SDD
converged: YES YES NO NO
title: Mulliken charges:
elementType: O O O O O C C C C C C C C C C C C C C C C C C C C H H H H H H H H H H H H H H H H H H
charge: -0.293665 -0.289775 -0.303510 -0.259593 -0.196615 0.294302 0.276266 0.345927 0.313115 -0.484669 -0.404700 0.098824 0.091426 -0.403894 0.189519 -0.350574 -0.360389 -0.241745 -0.349809 -0.362558 -0.359279 0.322759 -0.497010 -0.537949 -0.536749 0.250258 0.222310 0.239133 0.229295 0.273946 0.230978 0.250642 0.252943 0.244056 0.228899 0.255213 0.229507 0.235027 0.225813 0.234568 0.247613 0.225242 0.224901
chargesum: 0.00000
title: Mulliken charges with hydrogens summed into heavy atoms:
elementType: O O O O O C C C C C C C C C C C C C C C C C C C C
charge: -0.293665 -0.289775 -0.303510 -0.259593 -0.196615 0.294302 0.276266 0.345927 0.313115 -0.234411 -0.182390 0.098824 0.091426 -0.164761 0.189519 -0.121279 -0.086443 -0.010767 -0.099167 -0.109614 -0.115223 0.322759 0.216609 0.157460 0.161007
polarizability: 5.97811233e+02 4.29601475e+01 2.18271468e+02 -8.03744936e+00 1.51916572e+01 1.39433030e+02
1716.lowfreq: -11.1839 -3.0424 -2.1570 -0.0003 0.0001 0.0006 9.4755 20.8173 28.0925
frequency: 4.4874 20.7175 28.0520 40.7062 54.3464 69.1938 82.2692 92.3746 106.6430 133.5006 149.4875 158.6799 164.2216 175.9078 185.0492 194.0723 229.7972 231.7076 243.1487 256.5858 298.2445 305.6158 324.5490 342.7121 369.1508 393.9475 407.6024 419.7395 455.4853 465.1256 491.6754 514.0546 542.7791 553.4958 576.5292 582.7470 598.2343 631.2858 637.5612 655.9651 699.7725 728.2194 740.1025 743.0066 747.7635 772.3268 787.3089 789.3803 807.2656 820.2094 838.6764 852.6188 872.5172 902.8682 909.9217 942.6784 950.2057 959.4422 965.4448 969.7153 983.2089 995.4563 1015.4201 1019.7459 1075.2430 1106.5972 1110.6525 1111.3270 1113.2308 1144.9393 1147.6922 1156.3997 1166.2741 1176.8665 1183.5326 1205.1051 1221.3953 1236.1964 1237.9769 1273.1233 1291.0587 1306.8902 1355.5251 1366.3093 1374.8343 1415.3969 1426.3910 1433.6545 1435.7316 1446.7276 1449.4027 1454.5077 1456.9992 1460.9921 1467.4796 1472.1988 1477.0018 1495.1759 1565.9883 1569.0155 1583.0401 1598.6326 1615.8786 1636.3576 1702.4020 2958.9927 2964.6771 3009.9791 3048.3306 3055.1043 3075.7081 3115.4986 3120.6236 3127.4147 3129.4897 3136.3556 3141.3551 3147.5870 3155.0937 3169.0352 3170.6907 3176.1464 3209.3462
redmass: 3.2963 3.8363 5.0561 3.3918 2.9378 3.1865 3.9474 2.3672 4.0431 4.0467 3.4409 4.4186 1.1698 3.8273 5.9317 3.7187 1.3848 3.3317 3.7075 4.2550 4.5776 6.4600 3.9479 4.9633 4.8663 5.1393 4.0769 3.9303 5.1647 4.3293 5.9436 2.8167 4.0066 6.7727 4.9765 5.8326 4.5224 6.8444 3.8543 6.2426 6.0952 3.2351 4.9574 2.9250 4.0564 5.8843 2.2819 2.4295 2.3208 1.2651 1.7176 9.2025 1.6834 2.6129 2.2446 8.3402 8.0727 1.3674 1.3504 1.3561 8.5466 3.6259 2.5870 4.3917 1.9971 1.2286 1.2388 1.2656 1.3520 1.3416 1.3562 1.3356 1.4007 1.3511 1.4477 4.4555 1.6679 2.7855 2.7436 3.8784 3.7283 1.3563 2.7275 3.3809 5.1735 1.7348 1.2771 3.5825 1.2194 1.7103 1.0970 1.0726 1.0815 1.7608 1.0500 1.0847 1.0551 2.5002 6.9557 7.1218 6.3668 7.6606 6.5904 7.9520 12.4198 1.0311 1.0327 1.0279 1.1044 1.1042 1.0871 1.1011 1.1052 1.0878 1.0998 1.1059 1.0885 1.0904 1.0876 1.0994 1.0959 1.0965 1.0974
irintensity: 3.9232 2.7710 0.0996 2.1579 0.6477 0.5588 3.3488 1.8287 4.1917 3.4282 5.1133 2.7425 0.9401 2.7337 0.2958 7.2555 0.8736 13.9111 8.9219 3.2313 1.0513 3.9219 4.0772 3.4202 5.1677 1.5361 6.8635 5.2805 9.7804 10.2479 2.7081 11.3775 3.6770 1.6856 4.3102 27.4239 1.9359 4.2451 4.7283 6.3346 5.5364 7.5269 4.5844 42.1883 50.2794 5.5401 47.8486 33.3815 18.5092 1.3488 75.0035 91.5284 25.1394 28.0142 25.7512 72.5051 47.1283 0.0588 3.4969 0.7894 64.1529 3.9422 57.9917 81.1299 35.6131 1.1390 1.0223 1.1526 13.1088 0.8490 1.5517 2.4302 35.9444 226.9617 17.8902 2.6961 1.9680 244.4961 165.5370 133.5570 41.5462 17.1304 45.2114 35.9380 13.4141 57.2625 6.5567 49.7289 11.9761 31.7476 12.7785 8.2532 19.3441 50.8998 14.4081 80.7348 5.3199 212.2914 11.5459 20.9038 0.4175 26.5426 97.2621 220.6032 167.9704 69.0066 102.4056 57.7080 38.1367 44.5502 19.3760 29.9668 28.0767 5.4551 29.3939 13.7186 6.6197 10.3861 13.1472 26.9717 9.7976 9.2091 11.3682
temp: 298.150 k
press: 1.00000 atm
elementType: 8 8 8 8 8 6 6 6 6 6 6 6 6 6 6 6 6 6 6 6 6 6 6 6 6 1 1 1 1 1 1 1 1 1 1 1 1 1 1 1 1 1 1
symmnumber: 1
zpe: 863920.9 jmol-1
zpe.correction: 0.329050 hartree
zpe.thermalcorrener: 0.352757 hartree
zpe.thermalcorrenthalpy: 0.353701 hartree
zpe.thermalcorrgfe: 0.272144 hartree
zpe.sumelectzpe: -1147.194700 hartree
zpe.sumelectthermal: -1147.170993 hartree
zpe.sumelectthermalent: -1147.170049 hartree
zpe.sumelectthermalfe: -1147.251606 hartree
dipole: -1.3935 0.6886 2.4123
dipole: 2.8697
quadrupole: -103.4454 -130.1387 -149.3092
quadrupole: 12.8023 14.1152 -0.5079
quadrupole: 24.1857 -2.5076 -21.6781 12.8023 14.1152 -0.5079
hfenergy: -1147.5237502 hartree
pointgroup: C01 [X(C20H18O5)]
dipole: -0.5455693 0.081488 0.9850858 debye
polarizability: 595.2923251|53.7325074|212.8319773|-3.1498828|27.8868478|147.391429 unknown
InChI: InChI=1S/C20H18O5/c1-22-16-9-7-13(8-10-16)18-12-15(20(21)25-18)11-14-5-4-6-17(23-2)19(14)24-3/h4-12H,1-3H3
charge 0 multiplicity 1
43 atoms
O  -1.101433 -0.526351 -1.000835
O  2.850088 -1.204437 0.419246
O  5.685318 -1.478449 -0.202055
O  -7.401982 -0.370687 0.48074
O  1.103606 -0.708309 -1.758249
C  0.476559 0.800543 0.153841
C  -1.765502 0.270976 -0.013633
C  3.046341 1.19426 0.178489
C  -3.205416 0.087622 0.094433
C  -0.86117 1.072421 0.654057
C  1.643616 1.440031 0.533704
C  3.643725 -0.108495 0.090034
C  0.319133 -0.208221 -0.938492
C  3.880639 2.33877 -0.002567
C  5.039912 -0.212748 -0.186934
C  -3.969001 0.813787 1.0579
C  -3.885207 -0.820675 -0.761787
C  5.237111 2.219165 -0.35217
C  5.817742 0.933869 -0.443837
C  -5.354159 0.637438 1.158432
C  -5.278956 -1.006286 -0.669201
C  -6.018785 -0.274815 0.294298
C  2.983706 -2.462758 -0.359311
C  6.04117 -1.960028 1.150295
C  -8.144777 -1.292804 -0.384724
H  -1.097982 1.77157 1.454629
H  1.500259 2.312899 1.190049
H  3.427207 3.332656 0.092263
H  -3.47113 1.519339 1.731761
H  -3.305974 -1.378397 -1.503506
H  5.842791 3.11248 -0.533449
H  6.877568 0.796574 -0.68309
H  -5.948309 1.188579 1.893251
H  -5.771216 -1.712318 -1.344361
H  2.022529 -2.977808 -0.211232
H  3.126652 -2.239079 -1.427354
H  3.818523 -3.073831 0.01895
H  5.140545 -2.069214 1.785452
H  6.750535 -1.261933 1.635524
H  6.522259 -2.93902 1.001966
H  -9.193065 -1.202786 -0.065412
H  -8.051408 -1.005039 -1.449574
H  -7.800063 -2.335895 -0.248437
