program: Gaussian 09
title: 000244972
version: EM64L-G09RevD.01
frameworkgroup: C1[X(C12H17N7O4)]
method: RPBEPBE
basis: SDD
operation: Freq
keyword: #p
keyword: freq=noraman
keyword: PBEPBE/SDD
title: #p freq=noraman PBEPBE/SDD
converged: YES YES NO NO
title: Mulliken charges:
elementType: O O O O N N N N N N N C C C C C C C C C C C C H H H H H H H H H H H H H H H H H
charge: -0.423174 -0.202649 -0.411438 -0.220275 -0.190499 -0.396276 -0.067499 -0.093207 -0.076421 -0.143641 -0.584833 -0.378662 -0.348208 0.185955 -0.115446 -0.220385 -0.339512 0.330466 -0.534226 -0.693282 -0.007754 0.156319 0.214702 0.235002 0.225423 0.211917 0.222989 0.316582 0.196979 0.196864 0.334110 0.287527 0.254470 0.217342 0.213547 0.214704 0.331327 0.330105 0.387580 0.383474
chargesum: 0.00000
title: Mulliken charges with hydrogens summed into heavy atoms:
elementType: O O O O N N N N N N N C C C C C C C C C C C C
charge: -0.035594 -0.202649 -0.027963 -0.220275 -0.190499 -0.062166 -0.067499 -0.093207 -0.076421 -0.143641 0.076599 0.081764 0.086698 0.185955 0.201135 -0.220385 0.054331 0.330466 0.007771 -0.047688 -0.007754 0.156319 0.214702
polarizability: 2.58234719e+02 1.18824965e+01 1.76772119e+02 -4.93106398e+00 2.71108648e+01 1.65732465e+02
1716.lowfreq: -2.7274 -0.0008 -0.0006 -0.0005 3.6579 7.3090 12.7563 19.2276 20.2544
frequency: 12.6605 19.0070 19.8593 31.3893 40.4723 44.1956 61.2209 70.5686 81.8173 103.2794 111.3895 124.8001 152.3793 189.6723 196.0573 223.2482 228.4938 235.9494 261.4536 289.5318 306.5895 331.5121 356.5210 364.2181 419.5978 431.2020 457.2223 462.3412 496.1665 513.9550 529.2179 533.7783 554.0140 568.2429 589.8199 613.0959 628.8710 639.7913 662.1623 670.8319 680.8808 716.6073 721.2756 732.1689 743.1759 779.8472 791.4937 818.7516 840.5067 884.8805 897.6857 901.0036 919.0263 952.3165 977.9696 1017.1523 1027.1857 1038.3604 1045.9214 1072.8696 1078.2649 1101.5173 1114.1400 1141.3711 1150.9898 1186.8104 1197.6482 1235.0715 1240.7348 1258.1516 1265.9935 1267.3991 1274.7951 1283.4025 1290.9106 1313.7722 1338.7525 1342.4760 1351.1018 1361.3031 1364.9681 1391.0327 1398.7358 1442.7857 1450.2448 1462.6113 1470.8649 1475.7326 1475.7707 1477.3288 1488.9942 1500.2329 1579.6034 1594.8562 1617.2285 1672.2457 1678.2021 2966.7261 2975.7448 2989.4739 3011.0898 3012.6451 3017.3364 3026.4549 3048.1403 3072.5538 3075.3509 3082.1479 3086.5084 3512.1730 3520.1501 3547.2260 3564.2098 3723.6652
redmass: 3.8619 6.9189 5.9827 7.5796 7.8325 11.4643 2.6785 2.6002 4.8767 2.3560 6.4857 4.5211 5.8652 4.8732 2.0434 1.3687 5.5712 6.3554 5.5875 3.5957 5.8892 3.8917 6.1648 3.2621 4.7918 3.6773 1.2200 4.7850 4.5326 2.4218 1.1591 3.4796 1.5681 3.0880 1.4004 4.5444 3.7365 4.8061 2.1266 5.2049 3.4936 4.7530 9.3773 1.7757 1.8700 1.6480 10.6667 3.7908 6.0427 2.2225 2.7459 1.7445 3.8802 1.6437 4.1435 3.9457 3.3522 2.9148 2.4785 2.5120 3.3366 2.4934 2.3703 2.7753 3.3308 2.4261 1.6025 1.7242 1.9230 2.0470 1.8935 1.6422 1.8836 1.5399 1.0835 1.3264 1.6521 1.3970 3.9196 1.5199 1.9203 1.2198 4.0412 1.1955 1.2654 2.1310 1.0693 1.8452 1.3077 1.0645 1.0885 3.2653 6.0031 2.7413 2.3680 8.8304 9.3152 1.0588 1.0365 1.0594 1.0986 1.0619 1.0629 1.0798 1.1027 1.1010 1.0994 1.1008 1.1046 1.0640 1.0644 1.0777 1.0441 1.1060
irintensity: 0.1639 1.1507 0.3102 1.7887 0.6560 1.0301 0.4737 0.7235 0.4635 0.0627 0.1032 2.1854 1.6385 0.3687 1.8198 0.6812 1.5172 3.8658 2.9533 6.5526 8.0720 3.6065 4.3240 2.9243 4.9811 0.4904 270.2627 40.0427 15.5203 50.3621 6.4731 4.3925 13.0085 141.5213 164.4429 3.8432 20.0108 35.9663 76.4159 27.8687 28.7744 21.9103 8.5918 8.8291 5.2207 9.0322 19.6440 0.4036 14.4726 13.7449 55.8607 3.1679 15.9759 15.1080 4.2557 16.4319 96.2846 206.8540 215.7387 0.2326 56.0674 60.9175 14.6581 8.8806 20.2412 9.2467 9.2762 41.9320 17.5833 10.0324 8.5676 14.7823 7.7113 38.0271 1.6393 5.2707 60.9187 2.1112 103.1724 7.6660 49.8375 10.9548 27.2293 34.2275 25.7118 60.6504 0.0543 53.1656 80.8093 4.3213 17.4924 115.0978 599.2513 296.0349 507.1399 241.9929 176.1957 32.3157 32.4764 19.2079 9.2529 40.9577 10.7675 16.6477 7.5204 50.3289 54.5493 4.3717 33.8095 29.7163 27.6584 58.9725 117.5687 46.4694
temp: 298.150 k
press: 1.00000 atm
elementType: 8 8 8 8 7 7 7 7 7 7 7 6 6 6 6 6 6 6 6 6 6 6 6 1 1 1 1 1 1 1 1 1 1 1 1 1 1 1 1 1
symmnumber: 1
zpe: 806003.8 jmol-1
zpe.correction: 0.306991 hartree
zpe.thermalcorrener: 0.330182 hartree
zpe.thermalcorrenthalpy: 0.331127 hartree
zpe.thermalcorrgfe: 0.249486 hartree
zpe.sumelectzpe: -1149.927567 hartree
zpe.sumelectthermal: -1149.904376 hartree
zpe.sumelectthermalent: -1149.903431 hartree
zpe.sumelectthermalfe: -1149.985072 hartree
dipole: 1.7216 2.1974 1.9589
dipole: 3.4103
quadrupole: -103.4640 -125.6177 -137.7673
quadrupole: -0.6946 -9.5804 -0.1249
quadrupole: 18.8190 -3.3347 -15.4843 -0.6946 -9.5804 -0.1249
hfenergy: -1150.2345581 hartree
pointgroup: C01 [X(C12H17N7O4)]
dipole: -0.6555046 -1.0027651 0.6040973 debye
polarizability: 258.0528691|11.564974|186.6332357|6.2322659|-23.2463997|156.0531981 unknown
InChI: InChI=1S/C12H17N7O4/c1-2-3-4-19-10-8(17-18-19)9(15-12(13)16-10)14-6(11(22)23)5-7(20)21/h6,14,20,22H,2-5,13H2,1H3
charge 0 multiplicity 1
40 atoms
O  -4.347029 -2.266563 -1.416111
O  -2.442722 -1.616624 -2.582943
O  -5.020734 2.448646 0.764738
O  -3.966167 0.805541 2.025084
N  2.673176 1.170998 0.019216
N  -1.858661 0.342084 -0.607163
N  2.099933 2.180777 -0.826843
N  0.794033 1.888488 -0.975026
N  1.816399 -0.849346 1.172788
N  -0.604093 -1.157418 0.728515
N  0.59509 -2.626225 2.087813
C  4.104365 1.190377 0.339403
C  4.927478 0.219765 -0.537496
C  1.709508 0.254806 0.381164
C  -3.076518 -0.444767 -0.47153
C  0.525451 0.724409 -0.252593
C  6.429091 0.257971 -0.174589
C  -0.663441 -0.042473 -0.045543
C  -4.328372 0.460884 -0.398006
C  7.269811 -0.699282 -1.046575
C  0.611116 -1.497797 1.303032
C  -3.208912 -1.469702 -1.613316
C  -4.38559 1.211609 0.921984
H  4.44665 2.229958 0.196135
H  4.217185 0.925825 1.407066
H  4.789399 0.490261 -1.602293
H  4.536548 -0.807557 -0.405968
H  -2.991075 -1.020137 0.469579
H  6.810242 1.293364 -0.28812
H  6.555517 -0.008044 0.894799
H  -1.824494 1.112369 -1.278592
H  -5.23292 -0.171641 -0.465561
H  -4.368564 1.18023 -1.234353
H  8.339019 -0.66328 -0.768902
H  6.925012 -1.744025 -0.932785
H  7.188728 -0.434087 -2.117241
H  -0.280117 -3.124356 2.220495
H  1.454051 -2.925329 2.540608
H  -4.408639 -2.945017 -2.141617
H  -5.076257 2.907806 1.647047
