program: Gaussian 09
title: 000020402
version: EM64L-G09RevD.01
frameworkgroup: C1[X(C11H16O2)]
method: RPBEPBE
basis: SDD
operation: Freq
keyword: #pfreq=noraman
keyword: PBEPBE/SDD
title: #p freq=noraman PBEPBE/SDD
converged: YES YES NO NO
title: Mulliken charges:
elementType: O O C C C C C C C C C C C H H H H H H H H H H H H H H H H
charge: -0.411930 -0.440804 -0.204832 0.445873 0.267001 -0.596653 0.021130 0.385091 -0.687920 -0.674747 -0.557440 -0.489596 -0.830116 0.157382 0.231690 0.213261 0.215299 0.229802 0.228826 0.213426 0.219418 0.256135 0.200787 0.214417 0.227499 0.265528 0.227498 0.338797 0.335177
chargesum: 0.00000
title: Mulliken charges with hydrogens summed into heavy atoms:
elementType: O O C C C C C C C C C C C
charge: -0.073133 -0.105627 -0.047450 0.445873 0.267001 -0.364962 0.021130 0.385091 -0.029558 -0.013077 -0.301305 -0.074393 -0.109591
polarizability: 1.65892391e+02 -1.28964827e+00 1.31710730e+02 -4.42060631e+00 -2.99307909e+00 8.57684263e+01
1716.lowfreq: -10.0299 -0.0009 -0.0005 -0.0003 6.2616 7.6273 13.5082 73.7959 84.8736
frequency: -7.0431 73.7925 84.8725 116.5435 141.5186 177.1732 200.4882 218.6242 223.8641 240.2323 263.5943 281.2551 317.3474 347.9843 365.2567 371.4281 408.6777 427.9121 486.4261 501.2301 507.9362 569.0958 628.0894 690.1948 726.5653 746.6768 790.9130 880.7666 884.6752 890.2776 912.4754 919.5475 954.7668 972.0174 1007.3758 1038.7366 1048.8593 1089.2764 1115.6693 1122.9200 1153.1378 1158.4289 1190.2436 1214.3653 1268.2335 1279.8949 1292.7610 1305.7111 1335.1092 1370.3010 1379.2163 1394.3105 1397.5034 1399.5790 1425.2150 1464.4027 1465.2079 1468.4171 1474.9476 1478.9583 1483.6710 1489.4742 1500.1341 1578.3516 1635.2287 2914.7378 2966.7015 2974.0428 2977.7768 2981.8193 3057.2147 3065.5057 3072.3082 3078.1270 3081.4380 3086.0621 3093.7959 3105.0197 3152.3655 3552.1361 3558.0439
redmass: 2.7595 3.3112 5.0431 3.9498 1.0440 2.4646 2.4880 1.2505 3.6981 1.0920 2.9715 1.9824 2.4342 2.4559 1.5827 1.3123 3.2486 3.2575 3.6354 3.1172 4.3202 3.2671 4.3108 4.4801 5.7356 3.2305 3.2280 1.4584 2.3274 1.7481 1.1718 3.3676 1.4546 1.7059 1.4855 2.4918 1.5292 1.9196 2.4450 1.5203 1.1676 1.8667 2.2282 2.0757 1.3256 1.3701 1.7472 2.1697 1.8368 1.2107 1.1935 2.3604 1.2184 1.3579 3.8462 1.0485 1.0739 1.0549 1.1213 1.0787 1.0990 1.1242 2.6446 6.2680 6.9489 1.0813 1.0684 1.0401 1.0350 1.0353 1.0929 1.0952 1.1001 1.0995 1.1005 1.0998 1.1004 1.0900 1.0917 1.0662 1.0651
irintensity: 0.1183 0.2545 1.8181 1.1248 1.7562 0.6283 0.9421 0.6801 3.7072 0.1704 0.6132 29.7670 11.0516 34.3342 118.0090 95.6094 1.1953 0.4560 5.2958 8.2584 16.5729 1.2552 2.0016 7.4924 5.9425 3.2685 18.8951 6.9819 9.0276 47.6264 1.0848 54.8541 0.1727 3.6364 23.0082 31.3005 17.9893 21.1200 4.4868 149.4193 24.6166 16.3536 8.3659 58.2219 9.3925 2.2879 26.9933 0.6875 22.5803 41.8048 16.2630 9.2402 8.3492 18.7775 0.5968 0.7282 19.5682 3.6595 26.3613 17.3769 4.5056 7.7642 61.0852 45.1368 30.4216 54.8175 67.1142 30.1156 30.6150 31.3142 18.7361 23.0594 0.3481 90.5361 22.5356 33.8336 10.1418 21.7112 6.5516 5.2030 27.2227
temp: 298.150 k
press: 1.00000 atm
elementType: 8 8 6 6 6 6 6 6 6 6 6 6 6 1 1 1 1 1 1 1 1 1 1 1 1 1 1 1 1
symmnumber: 1
zpe: 640390.6 jmol-1
zpe.correction: 0.243912 hartree
zpe.thermalcorrener: 0.257459 hartree
zpe.thermalcorrenthalpy: 0.258403 hartree
zpe.thermalcorrgfe: 0.204950 hartree
zpe.sumelectzpe: -578.210241 hartree
zpe.sumelectthermal: -578.196693 hartree
zpe.sumelectthermalent: -578.195749 hartree
zpe.sumelectthermalfe: -578.249203 hartree
dipole: 3.0875 -1.1282 0.1355
dipole: 3.2899
quadrupole: -78.7606 -81.7919 -78.8329
quadrupole: -5.9634 -2.7061 0.4475
quadrupole: 1.0345 -1.9967 0.9622 -5.9634 -2.7061 0.4475
hfenergy: -578.4541526 hartree
pointgroup: C01 [X(C11H16O2)]
dipole: 1.2084972 0.4587477 -0.0667666 debye
polarizability: 166.0561975|1.4168954|131.9174733|2.1876974|-0.80209|85.3978769 unknown
InChI: InChI=1S/C11H16O2/c1-7(2)10-5-9(6-12)8(3)4-11(10)13/h4-5,7,12-13H,6H2,1-3H3
charge 0 multiplicity 1
29 atoms
O  1.70166 -2.43583 0.212755
O  -3.216955 1.718227 0.860762
C  2.571882 0.46101 0.008218
C  1.116533 -0.021135 -0.01563
C  -1.307124 0.510531 -0.222928
C  0.050079 0.899977 -0.16481
C  0.761038 -1.395695 0.070948
C  -1.637869 -0.879223 -0.138253
C  2.815126 1.542409 1.093247
C  3.016071 0.963973 -1.392966
C  -0.590976 -1.809514 0.013389
C  -2.384222 1.567815 -0.361997
C  -3.07934 -1.349501 -0.221953
H  3.241857 -0.389702 0.269289
H  0.287126 1.969682 -0.240455
H  2.228917 2.455462 0.882338
H  3.882296 1.83013 1.122603
H  2.523592 1.177045 2.093961
H  2.883967 0.180752 -2.160699
H  4.078774 1.270173 -1.383262
H  2.412021 1.837865 -1.698579
H  -0.801914 -2.881454 0.084507
H  -1.92871 2.543061 -0.631839
H  -3.123914 1.305187 -1.137017
H  -3.171146 -2.409111 0.070758
H  -3.732221 -0.741447 0.428023
H  -3.470464 -1.254506 -1.254232
H  2.620878 -2.071269 0.260515
H  -2.605864 1.828286 1.633606
