program: Gaussian 09
title: 000244944
version: EM64L-G09RevD.01
frameworkgroup: C1[X(C9H7BrClN5O2S)]
method: RPBEPBE
basis: SDD
operation: Freq
keyword: #p
keyword: freq=noraman
keyword: PBEPBE/SDD
title: #p freq=noraman PBEPBE/SDD
converged: NO YES NO NO
title: Mulliken charges:
elementType: Br Cl S O O N N N N N C C C C C C C C C H H H H H H H
charge: 0.081709 0.031563 0.309208 -0.260354 -0.238543 -0.421989 -0.378848 -0.360997 -0.055388 0.099623 0.262531 0.387020 0.113940 -0.213463 -0.302964 0.149960 -0.393797 -0.173347 -0.840639 0.354515 0.329078 0.371769 0.352681 0.269107 0.268558 0.259069
chargesum: 0.00000
title: Mulliken charges with hydrogens summed into heavy atoms:
elementType: Br Cl S O O N N N N N C C C C C C C C C
charge: 0.081709 0.031563 0.309208 -0.260354 -0.238543 -0.067474 -0.007079 -0.008316 -0.055388 0.099623 0.262531 0.387020 0.113940 0.115615 -0.302964 0.149960 -0.393797 -0.173347 -0.043904
polarizability: 2.98812961e+02 -1.67701954e+01 2.51202475e+02 -5.05788627e-02 -9.18561692e-02 6.93523405e+01
1716.lowfreq: -4.9378 -0.0010 0.0012 0.0016 3.1690 6.3604 27.8798 37.6194 52.6264
frequency: 27.8637 37.6187 52.6171 62.1871 71.6688 121.9053 125.9718 151.6019 166.5593 176.4094 178.4359 180.2474 196.7916 225.0640 259.0208 274.7440 293.8308 371.8519 377.4010 407.1030 410.7105 458.6112 481.0654 515.5570 541.8121 574.8725 581.2046 633.0100 644.9003 667.4269 688.6991 695.9050 735.0850 749.6405 755.7508 772.5794 780.0186 791.7467 842.9133 901.6159 930.3709 942.8699 972.8943 982.5064 994.9402 1128.1444 1194.4649 1207.3452 1228.7912 1256.7460 1295.7287 1319.2671 1344.2325 1356.5153 1378.3132 1410.7299 1424.7665 1441.7062 1450.2210 1460.1447 1498.8708 1574.3412 1614.8962 1659.3874 1690.0487 3014.3223 3139.6764 3140.3226 3222.0072 3379.6840 3528.8117 3566.0588
redmass: 8.2335 9.9802 6.6579 10.0688 4.5211 10.7746 7.8406 7.5294 3.4298 2.0089 16.6956 2.7733 7.5429 8.8710 11.8315 9.8823 11.3496 12.5752 5.6300 12.8380 3.9865 10.3364 12.2370 7.7536 9.1583 7.5695 11.5031 1.3663 6.8825 7.2971 7.8504 2.0288 3.5706 5.2745 8.7121 10.6815 2.4862 1.3338 7.0224 1.3158 5.7526 3.7430 3.6688 1.1723 1.6297 2.1397 3.3629 11.1416 4.3426 5.6753 8.1284 2.3490 1.2794 1.9700 2.4980 1.9458 4.9996 1.0542 3.5476 1.1224 7.9617 2.9979 6.0236 6.9070 5.8732 1.0280 1.1040 1.1058 1.0950 1.0757 1.0773 1.0784
irintensity: 0.3248 2.5612 0.5110 1.2179 3.2719 1.1505 0.7060 2.4316 0.1745 1.0051 2.2170 1.7253 3.3786 0.2358 0.9233 2.0177 0.3829 30.7581 0.1080 4.8546 8.4136 12.5138 17.4271 15.6786 42.9048 0.4296 0.3801 74.2140 3.9431 0.2604 3.2590 0.0007 26.8426 5.6273 0.0907 45.5719 91.9157 144.0201 24.4096 30.6970 44.4719 51.7410 1.9243 6.8303 2.0905 50.4196 11.8014 167.0167 114.6225 294.7907 80.6183 4.7980 15.6796 62.5670 135.3121 7.2723 100.7621 15.9187 166.6177 53.2170 555.1019 1027.1675 187.4016 244.2170 603.6248 16.4213 13.3441 13.6273 8.3805 110.9732 81.0624 85.9227
temp: 298.150 k
press: 1.00000 atm
elementType: 35 17 16 8 8 7 7 7 7 7 6 6 6 6 6 6 6 6 6 1 1 1 1 1 1 1
symmnumber: 1
zpe: 435028.8 jmol-1
zpe.correction: 0.165694 hartree
zpe.thermalcorrener: 0.183770 hartree
zpe.thermalcorrenthalpy: 0.184714 hartree
zpe.thermalcorrgfe: 0.116974 hartree
zpe.sumelectzpe: -1641.619948 hartree
zpe.sumelectthermal: -1641.601872 hartree
zpe.sumelectthermalent: -1641.600927 hartree
zpe.sumelectthermalfe: -1641.668668 hartree
dipole: -2.7256 2.5036 0.0005
dipole: 3.7009
quadrupole: -161.1434 -126.8063 -133.9908
quadrupole: -14.3361 0.0296 0.0479
quadrupole: -20.4966 13.8405 6.6561 -14.3361 0.0296 0.0479
hfenergy: -1641.785642 hartree
pointgroup: C01 [X(C9H7Br1Cl1N5O2S1)]
dipole: 0.8045006 -1.1997768 -0.1826067 debye
dipolederiv: -0.0103039 -0.1171391 -0.0156771 -0.0026136 -0.6553495 -0.101571 0.0006927 -0.1005429 0.0432149 -0.7374117 0.4263776 0.0697092 0.425793 -0.3374336 -0.046481 0.0699395 -0.0465175 -0.0565874 0.1148977 -0.1069196 -0.0162652 -0.0313095 -0.7057264 -0.0913375 -0.0070828 -0.0906233 -0.0570996 -0.6119295 -0.004867 0.0034929 -0.0328632 -1.1295386 -0.1120656 -0.00064 -0.1117072 -0.3758581 -1.7166135 0.3757866 0.0777949 0.4005728 -0.5830174 -0.0363652 0.0756037 -0.0342611 -0.3885779 -2.1519152 0.2059421 0.0607259 -0.4277521 -0.356939 -0.0041628 -0.0319374 -0.0141462 -0.2808943 -0.7804791 0.3860121 0.0634721 0.4244077 -0.771159 -0.0705818 0.069307 -0.0707555 -0.3428766 -1.6817557 0.5545128 0.1033046 -0.4071443 -0.3971702 -0.0090242 -0.0364677 -0.0243122 -0.296771 -1.0277622 -0.3651361 -0.0369257 -0.7102423 -0.9298912 -0.0954767 -0.0855475 -0.1008553 -0.1742823 -0.688239 0.3656274 0.0591745 -0.0100297 -1.6257286 -0.2085565 0.0057966 -0.2139973 -0.1569884 0.7816504 -0.5733124 -0.0957879 -0.5720525 -0.3930174 -0.0507529 -0.0937352 -0.0508431 0.0121206 2.296079 -0.0472124 -0.0409192 0.6562721 0.3082701 -0.0026 0.0617283 0.009586 0.2391255 1.0650769 0.0439145 -0.0068902 -0.0128744 1.4363976 0.1726349 -0.0153332 0.1705202 0.2807611 0.6610053 -0.6117935 -0.1014032 -0.0534936 0.3950203 0.0678843 -0.0201699 0.0768653 -0.0493604 -1.4108013 0.2266592 0.0522955 0.3046636 0.7709709 0.1294964 0.060896 0.1297355 -0.1396355 2.4385884 -0.4806506 -0.1053094 0.0423767 1.0155738 0.1008485 -0.0241822 0.1081953 0.3388805 0.6868034 0.0075868 -0.0104063 0.3506156 1.9502459 0.2654965 0.0382952 0.270449 0.0373993 1.7552475 -0.3195481 -0.0690631 -0.2838433 1.0696537 0.1414644 -0.0628748 0.1434733 0.0990654 0.0490122 -0.0833821 -0.0133536 -0.111703 0.0624005 0.0023874 -0.0165254 0.0020079 0.0551399 0.3939943 -0.0490849 -0.0087356 0.1236339 0.2688744 -0.0041675 0.0155143 -0.001164 0.2840476 0.1956544 0.0025858 -0.0004524 -0.0519748 0.0826673 -0.0115001 -0.008256 -0.0126845 0.1642366 0.2342025 0.0454249 0.0085286 0.073285 0.1841935 -0.024638 0.0125097 -0.0242523 0.3409391 0.1519557 -0.0063082 0.0022964 -0.0706294 0.2663643 -0.0095362 -0.0072169 -0.0103061 0.3392002 -0.0460627 0.0780858 -0.0801723 0.0034736 0.110854 -0.047644 -0.0802134 -0.0526444 -0.0353733 -0.041293 0.0579818 0.100575 -0.0153374 0.0752548 0.0777397 0.0802375 0.0803449 -0.0071975 0.0803991 -0.0111433 -0.0000083 -0.0112308 -0.1117701 -0.0314911 -0.0003377 -0.0315642 0.1273717 unknown
polarizability: 288.2034504|-25.1900864|257.8433757|-7.0236546|27.1659308|73.3209498 unknown
InChI: InChI=1S/C9H7BrClN5O2S/c1-19-9-14-5(11)4(10)6(15-9)13-3-2-12-8(18)16-7(3)17/h2,12-13,16H,1H3
charge 0 multiplicity 1
26 atoms
Br -1.961988 3.342192 0.452559
Cl -5.003568 1.849756 0.278547
S  -2.920086 -3.002177 -0.430257
O  2.416075 2.568488 0.277466
O  5.263608 -1.121568 -0.30464
N  0.175125 1.059709 0.09234
N  3.818409 0.713132 -0.015211
N  2.937609 -1.43967 -0.315096
N  -1.290679 -0.792507 -0.147339
N  -3.694959 -0.476203 -0.067448
C  1.406338 0.393536 -0.023032
C  -1.103196 0.557232 0.041564
C  2.552581 1.320406 0.093811
C  1.632634 -0.952629 -0.222761
C  -2.235124 1.438799 0.18373
C  4.098873 -0.654427 -0.220909
C  -2.573449 -1.239128 -0.189802
C  -3.507621 0.844277 0.116379
C  -1.182935 -3.704996 -0.54873
H  0.29055 2.075947 0.236052
H  0.808448 -1.657862 -0.312001
H  4.635045 1.327884 0.06214
H  3.10337 -2.43673 -0.462226
H  -0.633311 -3.50426 0.382651
H  -0.662335 -3.274652 -1.416896
H  -1.318615 -4.789149 -0.684993
