program: Gaussian 09
title: 000244932
version: EM64L-G09RevD.01
frameworkgroup: C1[X(C10H13NO2S)]
method: RPBEPBE
basis: SDD
operation: Freq
keyword: #p
keyword: freq=noraman
keyword: PBEPBE/SDD
title: #p freq=noraman PBEPBE/SDD
converged: YES YES NO NO
title: Mulliken charges:
elementType: S O O N C C C C C C C C C C H H H H H H H H H H H H H
charge: 0.170350 -0.272820 -0.235953 -0.693819 0.500314 -0.827619 -0.364306 -0.358606 0.486136 -0.404425 -0.403944 -0.767490 0.347029 -0.501427 0.293673 0.257228 0.229630 0.230484 0.215448 0.215131 0.268044 0.287001 0.305199 0.305171 0.244727 0.230480 0.244366
chargesum: 0.00000
title: Mulliken charges with hydrogens summed into heavy atoms:
elementType: S O O N C C C C C C C C C C
charge: 0.170350 -0.272820 -0.235953 -0.083449 0.500314 -0.276719 -0.134676 -0.128122 0.486136 -0.188976 -0.188813 -0.212446 0.347029 0.218146
polarizability: 2.26823805e+02 -7.91130668e+00 1.26396019e+02 2.06686540e+00 -9.40182774e+00 9.47830709e+01
1716.lowfreq: -10.9817 -0.0016 -0.0015 -0.0013 1.2840 10.6107 19.5199 25.5096 41.2351
frequency: 18.1595 25.0467 41.2087 65.7899 73.1254 87.2038 124.1549 153.6945 171.1908 234.4254 271.8127 292.5922 332.5274 358.6812 376.8471 392.5594 393.4154 409.4019 481.8803 515.6860 551.9230 629.9406 638.6420 653.0332 729.6022 736.4532 761.9423 774.7014 815.0826 828.4406 833.2316 889.7027 902.0279 941.1997 953.2636 974.6456 1001.0056 1017.4547 1100.1064 1103.5237 1113.1043 1141.6563 1148.1939 1187.7082 1223.8694 1229.6368 1230.1496 1243.9727 1317.5422 1317.9175 1389.7631 1417.1222 1422.9366 1439.0317 1451.6075 1463.5861 1466.2126 1521.2338 1581.0165 1632.6652 1643.7464 1646.0574 3004.1788 3021.3153 3049.0511 3100.9837 3106.2775 3112.9771 3114.8192 3135.0599 3139.2311 3141.7624 3147.6564 3566.8664 3707.0727
redmass: 4.8105 3.9154 5.5215 4.9067 4.1446 1.1735 4.4731 5.0414 5.6825 5.4062 3.4511 2.4480 3.1367 1.5078 1.0406 2.5174 2.7332 2.7101 4.7987 3.0303 7.0046 4.0155 6.5707 6.1425 6.1374 3.6808 3.8894 4.2573 1.2617 2.2522 3.5852 1.7909 1.7304 1.4065 1.3641 6.8951 2.8171 1.4253 1.6807 1.1683 1.2678 1.1133 1.4248 1.1029 1.4724 2.0238 1.4635 1.4832 3.2182 1.2821 5.4063 1.1051 1.1722 3.4563 1.0503 1.0818 1.0816 3.1499 6.6853 2.5304 2.1952 3.7005 1.0294 1.0580 1.0590 1.1078 1.1045 1.0870 1.0869 1.0965 1.1061 1.0975 1.1049 1.0449 1.1040
irintensity: 0.1739 0.4294 1.4272 0.8610 1.6991 0.6380 3.6322 2.0755 4.1388 7.4282 11.4500 2.8192 44.8545 278.0612 0.1539 0.7369 6.0583 0.0118 11.6752 12.0400 5.8330 41.5348 0.1807 6.1272 4.2925 3.7497 2.1139 24.2674 0.0927 47.0169 19.1844 5.5490 2.6659 0.0861 0.0381 46.8332 0.0344 0.0533 103.3318 17.9562 0.4455 13.7130 5.9439 42.6143 1.1013 122.0369 16.9511 39.6310 87.0807 1.1231 7.8820 14.4726 26.2460 0.0284 14.7260 10.7459 2.7367 100.6308 5.2892 35.9948 496.8624 113.2099 32.0877 22.5040 13.9193 5.3783 28.0152 2.7333 33.4985 42.4878 1.1202 2.0700 14.3701 88.1984 20.7053
temp: 298.150 k
press: 1.00000 atm
elementType: 16 8 8 7 6 6 6 6 6 6 6 6 6 6 1 1 1 1 1 1 1 1 1 1 1 1 1
symmnumber: 1
zpe: 557647.1 jmol-1
zpe.correction: 0.212397 hartree
zpe.thermalcorrener: 0.227782 hartree
zpe.thermalcorrenthalpy: 0.228726 hartree
zpe.thermalcorrgfe: 0.166796 hartree
zpe.sumelectzpe: -991.073973 hartree
zpe.sumelectthermal: -991.058587 hartree
zpe.sumelectthermalent: -991.057643 hartree
zpe.sumelectthermalfe: -991.119573 hartree
dipole: -3.6134 1.7835 2.2225
dipole: 4.6019
quadrupole: -69.8739 -80.0228 -95.7497
quadrupole: 1.4292 13.2337 -5.5622
quadrupole: 12.0082 1.8594 -13.8676 1.4292 13.2337 -5.5622
hfenergy: -991.2863692 hartree
pointgroup: C01 [X(C10H13N1O2S1)]
dipole: 1.3375098 -1.0719125 0.5831354 debye
polarizability: 224.2020711|-17.0008342|120.3236138|-5.750434|17.6531506|103.4772106 unknown
InChI: InChI=1S/C10H13NO2S/c1-13-10(12)7-14-6-8-2-4-9(11)5-3-8/h2-5H,6-7,11H2,1H3
charge 0 multiplicity 1
27 atoms
S  -1.118085 1.845882 -0.133784
O  -3.530913 -0.411983 0.56568
O  -4.580387 1.000154 -0.967024
N  5.005641 -0.720959 -0.775857
C  1.033532 0.145052 0.51899
C  -0.367802 0.451247 0.97192
C  2.151121 0.821103 1.075872
C  1.28274 -0.821755 -0.491106
C  3.706184 -0.433934 -0.35513
C  3.464726 0.542081 0.655759
C  2.588724 -1.113788 -0.923733
C  -2.879637 1.897346 0.585174
C  -3.760865 0.837182 -0.035832
C  -4.304239 -1.541645 -0.005849
H  -1.047844 -0.409461 0.873788
H  -0.396307 0.830159 2.007605
H  1.986883 1.579528 1.851372
H  0.436058 -1.349993 -0.946331
H  4.310037 1.07642 1.106829
H  2.752994 -1.868242 -1.703111
H  -2.806997 1.76898 1.676846
H  -3.276989 2.892714 0.339689
H  5.177272 -1.404767 -1.506829
H  5.801634 -0.22874 -0.381565
H  -5.385966 -1.343143 0.076179
H  -4.013622 -2.414645 0.59527
H  -4.043191 -1.683192 -1.068222
