program: Gaussian 09
title: 000244929
version: EM64L-G09RevD.01
frameworkgroup: C1[X(C14H18Cl2N2O3)]
method: RPBEPBE
basis: SDD
operation: Freq
keyword: #p
keyword: freq=noraman
keyword: PBEPBE/SDD
title: #p freq=noraman PBEPBE/SDD
converged: YES YES NO NO
title: Mulliken charges:
elementType: Cl Cl O O O N N C C C C C C C C C C C C C C H H H H H H H H H H H H H H H H H H
charge: -0.060205 -0.056584 -0.317165 -0.201254 -0.184773 -0.186859 -0.454875 0.516336 -0.389770 -0.383811 -0.630189 -0.399751 -0.586168 -0.585740 0.544299 -0.222953 -0.390500 0.077905 0.167237 -0.253616 -0.656857 0.251274 0.245853 0.247947 0.250600 0.227193 0.235860 0.271295 0.293424 0.267770 0.294692 0.227973 0.309276 0.357320 0.227367 0.242210 0.226620 0.253620 0.225001
chargesum: 0.00000
title: Mulliken charges with hydrogens summed into heavy atoms:
elementType: Cl Cl O O O N N C C C C C C C C C C C C C C
charge: -0.060205 -0.056584 -0.317165 -0.201254 -0.184773 -0.186859 -0.097555 0.516336 0.107357 0.114735 -0.402996 -0.163891 -0.021449 -0.023278 0.544299 0.005020 -0.081225 0.077905 0.167237 0.215962 0.048383
polarizability: 3.08810932e+02 3.10406949e+00 2.24871143e+02 5.15620387e-01 1.48027220e+01 1.12336133e+02
1716.lowfreq: -4.7025 0.0010 0.0017 0.0021 1.3155 4.2743 16.1389 23.4400 29.4403
frequency: 15.8136 23.4359 29.3857 34.1783 43.4121 52.5298 66.1382 78.2729 82.5839 100.7615 113.0443 133.7940 170.4418 193.7805 200.2498 207.9987 220.3746 233.6444 252.2034 262.2422 295.9718 327.5047 356.3483 366.7154 389.4541 409.0690 453.9712 467.1449 518.0233 537.2048 546.4290 597.6637 617.0608 666.0062 687.0998 697.6447 702.8072 743.7299 745.5774 763.2504 782.4377 786.0902 791.8563 808.9650 822.4091 848.9865 865.8284 891.1989 898.6245 971.3878 983.2714 986.6346 999.6056 1007.6227 1034.6259 1037.4974 1049.5749 1078.7643 1096.9949 1104.9962 1123.9572 1149.3899 1166.3436 1188.6879 1195.3711 1224.4556 1250.7180 1258.2031 1259.5793 1276.7721 1286.9423 1296.7040 1326.3977 1352.2018 1353.9308 1354.8952 1384.2246 1393.7234 1394.4006 1424.6586 1457.2293 1459.7949 1460.9336 1464.3509 1481.6389 1483.4646 1494.3111 1505.0002 1530.1127 1589.9641 1620.4782 1629.2263 1663.9103 2996.0269 3011.4441 3017.5314 3034.1243 3062.7397 3065.2139 3068.0564 3074.4569 3091.3892 3097.6070 3123.5416 3135.9916 3139.8295 3147.8009 3149.2133 3168.6441 3207.5721 3478.0173
redmass: 6.5086 5.5602 13.2131 9.4761 4.9456 5.4450 5.6857 6.6739 3.7363 4.1987 2.5524 2.7329 2.9694 9.4890 3.4301 4.3794 1.6402 5.8608 3.9559 4.5063 2.5106 3.8257 12.6978 5.1861 3.9826 3.5841 3.5940 4.2988 6.8548 4.8693 3.7360 6.9591 4.2254 6.9911 2.3489 3.5135 4.4641 2.9132 1.5336 4.8996 1.1483 1.3524 1.1586 1.6057 2.8758 1.8081 5.0449 1.4862 4.2829 3.9558 1.3159 2.6718 1.4330 2.7139 4.2683 3.6403 1.7103 5.4462 2.2347 1.7239 1.3614 1.7899 1.8458 2.2193 1.1123 2.1742 1.7125 1.1696 1.1681 1.1219 1.3969 1.2361 1.4089 1.2660 1.2977 1.4634 2.2607 3.6400 1.2598 2.6138 1.0901 1.0917 1.0982 1.0431 1.1317 1.0511 2.5173 1.0984 2.0816 5.0042 6.4596 7.9233 9.7255 1.0361 1.0607 1.0613 1.0597 1.0585 1.0588 1.1003 1.1031 1.0975 1.1032 1.1066 1.0900 1.0880 1.1116 1.1116 1.0942 1.0952 1.0765
irintensity: 1.2978 2.0446 1.5361 0.8747 2.6662 0.3110 0.2152 0.7329 0.2516 0.7756 1.2261 2.1161 2.4440 0.5093 4.4349 2.7985 2.0225 7.0310 8.1161 9.7242 6.6830 5.0577 4.2159 7.6279 2.3255 2.8307 6.3391 1.0121 10.0471 24.7948 3.3322 13.2667 1.7418 43.2078 56.0775 65.1309 34.5716 8.3257 53.3522 8.5006 2.4150 24.0437 15.1050 2.7435 2.7363 74.7665 27.9080 14.5836 26.6749 5.0276 3.3752 29.0883 3.7855 75.8781 0.2975 0.8557 25.1420 254.6648 7.3515 3.8926 48.4932 33.6825 42.4331 46.3013 14.2286 31.9540 15.4412 15.7865 8.4542 1.1874 32.1555 7.8056 9.9520 2.6571 7.2006 60.9914 21.0527 19.7891 30.7278 206.5433 12.7502 12.1019 15.3479 15.9493 33.7076 13.2948 246.5868 18.7701 107.8899 34.6601 499.6316 85.4987 221.3764 15.7003 25.0872 13.4885 26.4698 13.2579 13.6679 12.1967 11.8377 33.1942 1.3097 22.2594 14.9221 12.6684 8.6241 15.2015 18.2525 8.5173 52.5159
temp: 298.150 k
press: 1.00000 atm
elementType: 17 17 8 8 8 7 7 6 6 6 6 6 6 6 6 6 6 6 6 6 6 1 1 1 1 1 1 1 1 1 1 1 1 1 1 1 1 1 1
symmnumber: 1
zpe: 800430.4 jmol-1
zpe.correction: 0.304868 hartree
zpe.thermalcorrener: 0.327283 hartree
zpe.thermalcorrenthalpy: 0.328227 hartree
zpe.thermalcorrgfe: 0.248434 hartree
zpe.sumelectzpe: -1798.007755 hartree
zpe.sumelectthermal: -1797.985340 hartree
zpe.sumelectthermalent: -1797.984396 hartree
zpe.sumelectthermalfe: -1798.064189 hartree
dipole: -1.4225 4.5869 1.0582
dipole: 4.9176
quadrupole: -156.1782 -152.5990 -137.2345
quadrupole: 24.6312 9.5123 1.9486
quadrupole: -7.5077 -3.9284 11.4361 24.6312 9.5123 1.9486
hfenergy: -1798.3126226 hartree
pointgroup: C01 [X(C14H18Cl2N2O3)]
dipole: 0.5880109 1.8409142 -0.0917947 debye
polarizability: 308.5425908|-4.3306993|226.5337853|-5.2862114|6.749026|110.9418319 unknown
InChI: InChI=1S/C14H18Cl2N2O3/c1-2-21-14(20)13(19)17-11-4-3-5-12(10-11)18(8-6-15)9-7-16/h3-5,10,17H,2,6-9H2,1H3
charge 0 multiplicity 1
39 atoms
Cl 1.988787 4.3300 1.492165
Cl 6.727627 -0.750884 -1.089169
O  -3.855022 1.066892 0.254909
O  -3.113103 -2.460881 0.199686
O  -5.400996 -0.691591 0.211483
N  2.992457 0.511826 0.210099
N  -1.78701 -0.499743 0.218833
C  1.951252 -0.447161 0.207711
C  2.706357 1.954643 0.17542
C  4.407707 0.104442 0.236877
C  0.585141 -0.04846 0.220384
C  2.235719 -1.84816 0.193376
C  2.430439 2.492314 1.593006
C  4.916042 -0.216486 -1.18187
C  -0.459321 -1.009181 0.20958
C  1.185134 -2.785147 0.192157
C  -0.170366 -2.39786 0.197474
C  -2.979235 -1.207524 0.213371
C  -4.226069 -0.288009 0.222365
C  -4.970762 2.071609 0.247678
C  -5.40611 2.382599 -1.18565
H  3.573782 2.488473 -0.250961
H  1.848807 2.173812 -0.485991
H  5.013163 0.92543 0.659825
H  4.556999 -0.767617 0.897699
H  0.312979 1.012481 0.242393
H  3.265687 -2.214323 0.17961
H  3.31615 2.431613 2.242565
H  1.570313 2.001717 2.070457
H  4.895842 0.66357 -1.841924
H  4.376608 -1.056037 -1.642928
H  1.431378 -3.852671 0.181493
H  -0.979646 -3.128126 0.191968
H  -1.901692 0.520304 0.227099
H  -4.534177 2.946462 0.75468
H  -5.802527 1.658683 0.844598
H  -4.555586 2.739848 -1.791324
H  -5.841366 1.491265 -1.667272
H  -6.176483 3.175579 -1.172075
