program: Gaussian 09
title: 000244922
version: EM64L-G09RevD.01
frameworkgroup: C1[X(C11H11Cl2NO3)]
method: RPBEPBE
basis: SDD
operation: Freq
keyword: #p
keyword: freq=noraman
keyword: PBEPBE/SDD
title: #p freq=noraman PBEPBE/SDD
converged: YES YES NO NO
title: Mulliken charges:
elementType: Cl Cl O O O N C C C C C C C C C C C H H H H H H H H H H H
charge: -0.060041 -0.038922 -0.302792 -0.229432 -0.188156 -0.318163 -0.571018 0.594313 -0.276410 -0.352458 -0.209998 -0.223627 -0.095852 0.136630 -0.253297 0.182319 -0.657382 0.259027 0.257821 0.274220 0.353993 0.282224 0.263403 0.241076 0.226899 0.223635 0.229152 0.252835
chargesum: 0.00000
title: Mulliken charges with hydrogens summed into heavy atoms:
elementType: Cl Cl O O O N C C C C C C C C C C C
charge: -0.060041 -0.038922 -0.302792 -0.229432 -0.188156 0.035829 -0.054170 0.594313 -0.276410 -0.078238 0.072226 0.039776 -0.095852 0.136630 0.214678 0.182319 0.048240
polarizability: 1.82562202e+02 7.64774739e+00 1.61083970e+02 -2.29218964e+01 -2.96280689e+00 1.13573990e+02
1716.lowfreq: -8.4591 -3.0128 -0.9775 -0.0025 -0.0022 -0.0019 16.4861 21.3993 25.1030
frequency: 16.4555 21.3757 25.0722 44.6826 69.7817 82.6685 106.6640 125.1104 163.0426 178.5517 199.3665 211.1913 246.5154 299.3024 308.7004 340.3181 357.5380 369.3666 403.3844 426.9216 433.4408 449.1858 494.3851 525.3871 569.2706 638.0321 658.4015 682.6196 708.4839 733.6363 766.5028 771.4585 811.5103 817.7651 842.1140 847.5432 863.5347 961.7291 979.2847 1007.5238 1021.2240 1032.9074 1081.6847 1091.3622 1099.9447 1143.9491 1154.9257 1205.7022 1215.7677 1248.3287 1276.4909 1277.3195 1349.0530 1353.8324 1375.3785 1379.3454 1394.1670 1445.2692 1458.8004 1459.9013 1464.6451 1476.5733 1484.2211 1569.7236 1593.0480 1624.9583 1661.1311 2995.4780 3031.9705 3033.5705 3090.9357 3095.8640 3097.0742 3123.1180 3152.4009 3179.7904 3184.1291 3535.4375
redmass: 7.1885 6.1457 7.3196 4.5789 6.7494 4.8966 5.9900 4.2220 6.0543 11.5011 3.4997 1.9177 3.0664 3.0403 3.4846 5.6366 8.6954 9.4506 5.7629 3.6927 3.0029 4.5648 6.0226 8.1920 4.2740 3.9300 1.3664 4.3802 3.6927 4.5233 9.6613 2.5403 2.2936 1.5986 2.6886 2.4062 1.4032 1.4119 2.3657 2.7232 3.9915 4.8048 2.6709 3.7136 2.7786 1.3701 1.6496 2.6592 1.8109 1.5714 1.1313 1.2802 1.3897 1.3161 4.1846 2.7867 1.2268 1.3359 1.2111 1.6973 1.0493 1.7112 1.0514 7.5618 7.4183 9.5063 10.6809 1.0362 1.0592 1.0597 1.0974 1.1046 1.1033 1.1065 1.0903 1.0959 1.0940 1.0783
irintensity: 1.8918 3.2700 2.4694 3.7215 0.9317 0.2850 0.3757 0.7566 0.4178 1.9730 3.4159 1.2768 1.8978 6.4529 1.0299 8.2374 2.3089 6.4067 8.9820 2.6639 6.2418 1.1266 8.6182 28.5595 27.4503 19.4110 121.6736 12.7265 12.6298 9.3984 2.1794 14.6181 53.7542 7.1145 49.6819 6.1672 19.8660 0.3048 17.1756 64.0268 26.0478 18.4690 73.8985 194.5354 54.7855 0.5084 20.1987 6.4109 27.5285 22.3237 2.4284 10.8990 11.2649 5.2582 2.0623 10.8221 22.2780 69.8302 37.7705 47.9975 12.4215 192.9083 14.8849 27.5295 51.4839 146.0156 169.2081 14.3867 20.0912 29.4077 32.8333 1.3373 0.9072 24.3028 0.3823 0.5565 0.8993 47.7199
temp: 298.150 k
press: 1.00000 atm
elementType: 17 17 8 8 8 7 6 6 6 6 6 6 6 6 6 6 6 1 1 1 1 1 1 1 1 1 1 1
symmnumber: 1
zpe: 532441.3 jmol-1
zpe.correction: 0.202796 hartree
zpe.thermalcorrener: 0.220173 hartree
zpe.thermalcorrenthalpy: 0.221117 hartree
zpe.thermalcorrgfe: 0.153386 hartree
zpe.sumelectzpe: -1625.070670 hartree
zpe.sumelectthermal: -1625.053293 hartree
zpe.sumelectthermalent: -1625.052349 hartree
zpe.sumelectthermalfe: -1625.120081 hartree
dipole: 0.8016 4.0717 -0.5016
dipole: 4.1801
quadrupole: -110.5998 -119.6523 -109.1554
quadrupole: 19.5795 4.3457 2.8626
quadrupole: 2.5361 -6.5165 3.9804 19.5795 4.3457 2.8626
hfenergy: -1625.2734664 hartree
pointgroup: C01 [X(C11H11Cl2N1O3)]
dipole: 0.6305279 1.4788404 -0.3465409 debye
polarizability: 178.1051475|1.0966126|158.930105|-31.0996038|0.0405406|120.1849099 unknown
InChI: InChI=1S/C11H11Cl2NO3/c1-2-17-11(16)10(15)14-6-7-3-4-8(12)5-9(7)13/h3-5,14H,2,6H2,1H3
charge 0 multiplicity 1
28 atoms
Cl -0.672431 2.665889 -1.178309
Cl -4.699742 0.913945 2.209143
O  3.421573 -0.204368 -0.298158
O  0.884087 -2.711959 -0.811245
O  3.563083 -2.464482 0.296154
N  1.039605 -0.441901 -1.346304
C  -0.308319 -0.372309 -1.94049
C  -1.390661 -0.040606 -0.918764
C  -1.660723 1.281059 -0.494262
C  -2.167758 -1.074918 -0.335909
C  -2.655899 1.600253 0.448503
C  -3.173615 -0.802685 0.61652
C  -3.403614 0.535541 0.989249
C  1.517416 -1.61871 -0.814153
C  4.781393 0.052601 0.283739
C  2.936391 -1.515558 -0.206229
C  4.677919 0.353626 1.780387
H  -0.520882 -1.357493 -2.387857
H  -0.287092 0.386805 -2.740377
H  -1.958814 -2.110109 -0.625512
H  1.610196 0.402876 -1.257221
H  -2.840837 2.634028 0.749392
H  -3.761144 -1.611924 1.057815
H  5.408299 -0.835157 0.08976
H  5.149983 0.914777 -0.294005
H  5.677978 0.614173 2.173573
H  4.001584 1.205054 1.968097
H  4.310824 -0.525948 2.334959
