program: Gaussian 09
title: 000244920
version: EM64L-G09RevD.01
frameworkgroup: C1[X(C9H8ClNO3)]
method: RPBEPBE
basis: SDD
operation: Freq
keyword: #p
keyword: freq=noraman
keyword: PBEPBE/SDD
title: #p freq=noraman PBEPBE/SDD
converged: YES YES NO NO
title: Mulliken charges:
elementType: Cl O O O N C C C C C C C C C H H H H H H H H
charge: -0.051727 -0.215915 -0.454599 -0.170626 -0.349127 0.508632 -0.518329 -0.354635 -0.431010 -0.206817 -0.200070 -0.108178 0.167550 0.114881 0.269699 0.238449 0.252335 0.239126 0.355902 0.258610 0.258048 0.397800
chargesum: 0.00000
title: Mulliken charges with hydrogens summed into heavy atoms:
elementType: Cl O O O N C C C C C C C C C
charge: -0.051727 -0.215915 -0.056798 -0.170626 0.006775 0.508632 -0.010181 -0.102299 -0.191883 0.051793 0.057977 -0.108178 0.167550 0.114881
polarizability: 1.79314285e+02 3.48458501e+00 1.00124070e+02 -1.68844559e+01 1.08457682e+01 8.77861660e+01
1716.lowfreq: -9.1289 -3.7742 -0.0013 0.0016 0.0021 3.6974 14.4245 29.9537 39.6761
frequency: 13.3910 29.9107 39.6545 52.0528 107.3082 170.4999 214.5179 219.3561 281.1614 318.7863 351.8570 392.3111 409.1020 422.7798 452.4531 477.7270 544.2294 611.1239 620.6143 627.3683 644.0922 696.5538 718.6228 766.2718 783.0963 824.3474 832.4642 838.3629 947.8045 968.3684 986.4534 1001.0720 1025.8872 1049.4310 1072.8031 1112.4633 1173.4733 1185.1358 1212.6987 1238.3220 1288.3665 1297.6912 1344.5455 1382.5356 1400.3830 1468.9020 1481.2898 1486.7484 1589.0782 1602.9706 1631.1882 1686.2020 2991.8508 3050.2396 3129.2382 3140.7713 3170.7814 3173.7040 3527.0769 3531.2636
redmass: 6.0163 5.9197 8.3754 13.2813 7.3496 6.6449 4.7516 8.1298 4.9019 5.6404 4.1416 7.8985 2.9035 4.5891 3.6669 4.0251 3.8404 2.0419 2.6422 5.5411 3.9244 1.2627 3.2004 10.8839 4.0780 1.8614 1.2652 2.7430 1.3600 1.3778 2.6847 4.1061 2.9343 4.3200 2.7512 1.3394 2.0258 1.1242 2.7829 1.1942 1.9817 1.3460 1.6354 5.2277 2.3216 1.2668 1.8764 1.7409 7.2931 6.1335 9.5362 10.3389 1.0607 1.1011 1.0901 1.0896 1.0952 1.0962 1.0664 1.0767
irintensity: 4.6803 4.8065 1.0084 1.0317 1.3327 1.1118 0.9226 2.5877 1.0124 5.1059 5.3301 16.0610 0.0687 3.7745 2.5545 27.0788 20.7288 145.6538 81.4798 4.2542 21.1978 96.9553 10.4003 3.1440 13.7845 69.1252 4.0453 24.0318 2.3489 0.5846 38.1488 44.7455 198.6631 11.9659 40.9971 17.2974 30.3193 0.2480 1.8493 38.9129 10.6566 4.2695 5.3778 3.5226 13.1548 74.4947 21.4771 207.8461 2.0208 7.9800 215.9750 220.3087 28.5014 10.6936 10.6641 5.7276 5.7605 0.2983 51.0332 28.8221
temp: 298.150 k
press: 1.00000 atm
elementType: 17 8 8 8 7 6 6 6 6 6 6 6 6 6 1 1 1 1 1 1 1 1
symmnumber: 1
zpe: 411567.7 jmol-1
zpe.correction: 0.156758 hartree
zpe.thermalcorrener: 0.169876 hartree
zpe.thermalcorrenthalpy: 0.170820 hartree
zpe.thermalcorrgfe: 0.113347 hartree
zpe.sumelectzpe: -1087.239068 hartree
zpe.sumelectthermal: -1087.225950 hartree
zpe.sumelectthermalent: -1087.225005 hartree
zpe.sumelectthermalfe: -1087.282479 hartree
dipole: -1.1552 0.1830 4.4484
dipole: 4.5996
quadrupole: -110.3927 -80.1697 -87.9727
quadrupole: -7.2030 16.1783 2.6456
quadrupole: -17.5476 12.6753 4.8724 -7.2030 16.1783 2.6456
hfenergy: -1087.395826 hartree
pointgroup: C01 [X(C9H8Cl1N1O3)]
dipole: 0.2099116 1.2547007 -1.2870135 debye
dipolederiv: -0.7462552 0.1381888 0.2658988 0.1697062 -0.1627549 -0.0757142 0.2941911 -0.0703542 -0.1849197 -0.577249 -0.0674119 -0.0470191 -0.2591751 -0.4524123 0.1359355 0.3528191 0.2770199 -0.8239952 -0.4632851 0.0026757 0.0567272 0.0086201 -0.5235899 0.2707999 -0.0132395 0.3019084 -1.0794938 -0.8128982 -0.3223488 0.1553443 -0.2859612 -0.5014118 0.1779847 -0.1514376 0.010928 -0.5033009 -1.1108917 -0.2273712 0.2777053 -0.2086608 -0.5723788 0.1234568 0.1241538 0.0313021 -0.4649028 0.1389912 -0.0307133 -0.100409 -0.0399185 -0.1000553 -0.0249653 -0.2016409 -0.0458445 -0.0064062 0.5549215 0.0273392 -0.0109202 -0.1078927 0.2831101 0.0918997 0.3658286 0.150806 0.1215026 -0.0459943 0.0514338 -0.0336441 0.0381651 0.0400547 0.0169911 -0.0158924 -0.0051478 -0.1254478 -0.0631715 -0.0161665 -0.0470947 0.0608242 0.0892468 0.0279462 -0.0595295 0.0543357 -0.1227544 -0.2969954 0.0162813 0.0755941 0.0109775 0.0239301 0.0143675 0.0825928 0.0114391 -0.127669 -0.2428922 0.1198331 0.0620565 0.1600095 -0.0536178 -0.0516674 0.0974902 -0.0363837 -0.1341761 1.0290788 -0.2220559 -0.4499845 -0.2703053 0.1642006 0.1333427 -0.4773845 0.127677 0.1244716 0.8840817 0.3642127 -0.1883761 0.5804844 0.5786231 -0.3732604 -0.4710506 -0.381376 0.9434695 1.025404 0.4435649 -0.1435553 0.406184 0.6606693 -0.41036 0.1285811 -0.3302139 1.1918609 0.046983 0.015511 0.0724267 0.0498718 0.0929881 0.0722569 -0.0618623 -0.0001419 0.0288058 -0.0309565 -0.0558003 -0.0079043 0.0047457 -0.1422329 -0.0628209 -0.0655593 -0.0198539 0.1060578 0.020531 -0.0841424 0.0426977 -0.0992831 0.0202264 0.0095841 0.0505513 0.0138425 0.1233548 0.076938 0.0670092 0.0417105 0.0465442 -0.069946 -0.0519482 0.0328736 -0.059387 0.1295319 0.3225724 -0.0631177 0.0057291 -0.0924691 0.2739667 0.0401791 -0.0285708 0.0118326 0.2100352 0.0845549 0.0305213 0.0326833 0.0343788 -0.0214922 -0.0403453 0.0292886 -0.042154 0.1453448 0.0216805 -0.0777012 0.0399446 -0.070789 0.0359644 0.0065 0.0501967 0.010509 0.1504596 0.1848522 -0.1097419 -0.0996108 -0.1360566 0.3369115 -0.0301626 -0.0623995 -0.0107433 0.2981717 unknown
polarizability: 172.3657762|13.7451256|106.7418387|-26.9930783|2.3547102|88.116906 unknown
InChI: InChI=1S/C9H8ClNO3/c10-7-3-1-6(2-4-7)5-11-8(12)9(13)14/h1-4,11,13H,5H2
charge 0 multiplicity 1
22 atoms
Cl 5.030646 -0.495706 -1.250688
O  -2.586153 -0.715868 2.054309
O  -3.435343 -0.077511 -1.396271
O  -4.634488 -1.404292 0.101883
N  -1.585015 0.539642 0.343646
C  0.90156 0.645812 0.535974
C  -0.445587 1.014924 1.147401
C  1.196554 -0.701523 0.204329
C  1.887997 1.636463 0.313145
C  2.449354 -1.057119 -0.33874
C  3.150496 1.29973 -0.227891
C  3.409259 -0.04593 -0.546965
C  -2.55739 -0.284065 0.8687
C  -3.664184 -0.670813 -0.136884
H  -0.568409 0.556328 2.14636
H  -0.513919 2.11242 1.274625
H  0.445258 -1.480636 0.376243
H  1.677971 2.683388 0.56321
H  -1.662086 0.813078 -0.639838
H  2.677754 -2.096696 -0.590348
H  3.911339 2.066639 -0.398379
H  -4.153111 -0.336262 -2.03432
