program: Gaussian 09
title: 000244915
version: EM64L-G09RevD.01
frameworkgroup: C1[X(C20H30O3)]
method: RPBEPBE
basis: SDD
operation: Freq
keyword: #pfreq=noraman
keyword: PBEPBE/SDD
title: #p freq=noraman PBEPBE/SDD
converged: YES YES NO NO
title: Mulliken charges:
elementType: O O O C C C C C C C C C C C C C C C C C C C C H H H H H H H H H H H H H H H H H H H H H H H H H H H H H H
charge: -0.229689 -0.213259 -0.220375 -0.119907 0.382698 -0.142736 -0.105306 0.391462 -0.529062 -0.536239 -0.230438 -0.557240 -0.495197 -0.080408 -0.476375 -0.480657 -0.823607 -0.516604 -0.843423 0.158101 -0.547009 0.172043 -0.802657 0.208807 0.236220 0.187155 0.200783 0.206862 0.231909 0.210701 0.232499 0.211709 0.235837 0.228549 0.202609 0.216725 0.263453 0.210283 0.227405 0.229368 0.226164 0.222469 0.252213 0.215298 0.235686 0.222110 0.245279 0.228109 0.252491 0.258781 0.242741 0.248683 0.254983
chargesum: 0.00000
title: Mulliken charges with hydrogens summed into heavy atoms:
elementType: O O O C C C C C C C C C C C C C C C C C C C C
charge: -0.229689 -0.213259 -0.220375 0.088900 0.382698 0.093485 0.081848 0.391462 -0.121416 -0.093629 0.002062 -0.109694 -0.064038 0.136318 -0.002639 -0.023884 -0.122760 -0.065621 -0.147924 0.158101 -0.035738 0.172043 -0.056250
polarizability: 2.73886072e+02 -2.77785920e+00 1.99288939e+02 -4.14145325e-01 2.53209265e+00 1.66143935e+02
1716.lowfreq: -16.4578 -6.3788 -2.9251 -0.0005 -0.0004 -0.0003 36.5731 45.9880 65.7976
frequency: 36.5086 45.9690 65.7813 71.9054 88.0193 105.4978 125.2243 126.7015 145.1846 157.9434 191.3414 200.2978 215.4053 219.6469 235.2959 246.4684 259.2665 271.2321 283.9773 300.7679 319.2587 337.4534 361.9253 365.8131 386.7017 408.8597 424.6557 433.6683 459.4244 484.8424 494.3666 509.0459 527.7317 556.7532 566.4461 568.1538 580.4222 621.4111 650.0220 703.9218 710.7967 727.8756 767.5179 805.3549 811.0973 820.0714 831.7524 854.0100 889.6852 899.2471 917.3233 921.2282 931.1609 934.3760 948.5662 965.0912 967.6767 981.0547 992.4039 1005.5421 1011.4855 1016.9379 1027.8447 1032.5859 1041.8850 1051.2540 1071.2912 1083.2114 1091.2772 1105.3820 1123.4832 1129.2008 1130.7499 1144.4666 1157.7320 1159.6498 1165.1424 1184.2855 1192.2489 1202.3211 1205.0597 1213.5864 1225.1592 1233.0638 1238.1038 1249.2940 1255.2656 1272.1259 1278.7307 1286.4178 1293.0935 1299.9148 1308.6392 1318.2542 1322.8307 1327.4860 1327.8793 1330.4934 1335.5627 1338.2130 1347.3105 1352.8648 1361.3322 1365.5908 1367.5444 1401.9289 1409.0064 1440.0933 1444.5769 1452.1555 1458.6055 1466.8418 1467.6537 1469.5163 1471.2937 1474.6382 1479.8426 1486.0399 1491.2218 1493.0320 1496.3238 1622.4169 1652.1594 2898.9000 2906.8134 2948.9454 2951.4450 2954.0100 2971.0844 2973.0786 2974.7281 2978.1605 2985.7174 2990.1023 2991.1248 2992.9686 2997.5691 3004.8325 3013.0055 3015.1120 3038.8345 3040.4203 3045.2639 3050.6078 3061.8955 3063.3777 3065.8087 3074.0660 3077.5673 3078.8789 3085.3545 3094.7931 3118.6415
redmass: 6.1349 3.6940 4.3157 3.9084 4.0457 3.5145 1.3838 1.5440 1.8691 4.2038 2.0593 2.1727 1.5529 2.0649 2.1685 2.0760 2.8178 3.0389 2.3252 2.8857 3.1439 3.2574 2.5216 2.9722 3.2620 3.3299 3.5411 3.1293 3.4970 3.9324 2.3989 2.4550 2.6657 3.1374 2.7477 4.1291 3.6444 3.0981 2.8253 2.2863 2.7155 3.3350 3.5899 2.1692 2.3617 2.1675 1.6799 1.9093 2.2846 1.9314 2.6193 2.1258 1.8226 1.8649 2.0724 2.6893 1.9058 2.0658 2.3774 1.9242 2.0577 2.1072 1.8367 1.9692 2.0547 2.3246 2.6940 2.3294 1.6509 1.6746 2.6546 1.9095 2.4126 1.6013 2.7658 2.4177 1.6655 1.9674 2.0421 1.9696 1.6669 1.2340 1.7618 1.2826 1.4134 1.4242 1.4153 1.4491 1.5085 1.4537 1.4038 1.3110 1.3588 1.4578 1.4445 1.4024 1.4055 1.4118 1.4266 1.5446 1.4594 1.4498 1.4910 1.4979 1.2685 1.2082 1.1936 1.0721 1.0737 1.0598 1.0722 1.0862 1.0861 1.0781 1.0797 1.0869 1.0711 1.0602 1.0756 1.0611 1.0589 7.3026 12.0536 1.0814 1.0798 1.0825 1.0609 1.0694 1.0774 1.0708 1.0698 1.0445 1.0574 1.0483 1.0450 1.0496 1.0650 1.0616 1.0644 1.0953 1.0971 1.0967 1.0985 1.1001 1.0945 1.0979 1.1028 1.0983 1.1034 1.0987 1.0979 1.0983 1.1006
irintensity: 4.2275 2.0924 3.1157 2.6635 1.2383 2.7733 1.2523 1.7032 0.1708 0.5213 0.9981 0.0145 0.6709 0.4844 0.9712 1.6450 2.2599 2.3661 1.8644 1.8438 2.4325 0.7430 1.0505 2.0796 0.2469 1.0986 0.2574 0.4310 3.1153 1.8014 1.4428 1.7354 1.8196 1.2772 3.6391 7.7130 8.0616 0.0762 0.8605 4.5933 7.0074 2.3659 8.6070 0.6179 2.4191 3.9871 0.4531 8.2984 16.4880 2.7757 3.2279 0.2751 4.0889 3.7273 18.4149 67.5009 16.5234 16.3908 20.0470 26.0342 6.7720 18.7574 31.5685 32.5974 25.8370 5.4720 5.8525 10.0011 3.1597 30.0931 5.7503 6.1556 23.6774 4.2533 122.2675 74.5624 20.4748 17.9549 27.2188 8.4233 20.8374 4.0980 8.9484 14.2013 19.7752 3.3101 3.6633 6.5759 0.1732 14.2034 1.2289 0.7313 0.6126 0.6662 3.2765 1.5873 1.1394 2.6850 10.8226 10.4414 15.4713 5.2822 7.2157 3.2725 70.1305 18.3471 31.4821 18.0991 16.7035 9.7167 8.4309 6.2436 15.6979 7.2713 5.8793 9.7687 3.1784 4.1454 5.4629 5.9161 13.0933 114.6965 373.7274 3.4086 26.0387 13.7091 40.6765 23.5932 8.4117 4.5343 71.3483 18.8615 14.7418 15.5937 19.7005 42.1949 10.4754 21.0005 40.3720 35.2745 24.5338 60.9110 34.6827 24.8183 9.5353 9.6179 46.7854 31.9949 42.0104 18.4357 29.9364 18.5708 16.2185
temp: 298.150 k
press: 1.00000 atm
elementType: 8 8 8 6 6 6 6 6 6 6 6 6 6 6 6 6 6 6 6 6 6 6 6 1 1 1 1 1 1 1 1 1 1 1 1 1 1 1 1 1 1 1 1 1 1 1 1 1 1 1 1 1 1
symmnumber: 1
zpe: 1211409.5 jmol-1
zpe.correction: 0.461402 hartree
zpe.thermalcorrener: 0.483654 hartree
zpe.thermalcorrenthalpy: 0.484598 hartree
zpe.thermalcorrgfe: 0.411717 hartree
zpe.sumelectzpe: -1004.024196 hartree
zpe.sumelectthermal: -1004.001943 hartree
zpe.sumelectthermalent: -1004.000999 hartree
zpe.sumelectthermalfe: -1004.073880 hartree
dipole: -3.4265 -2.3380 -2.4658
dipole: 4.8257
quadrupole: -206.7663 -133.0532 -136.5695
quadrupole: -4.6284 11.2676 0.5900
quadrupole: -47.9700 25.7431 22.2268 -4.6284 11.2676 0.5900
hfenergy: -1004.4855973 hartree
pointgroup: C01 [X(C20H30O3)]
dipole: 1.3400593 -0.9090827 0.9911402 debye
polarizability: 273.888747|2.76543|199.2236057|0.3883007|-2.8938447|166.2065942 unknown
InChI: InChI=1S/C20H30O3/c1-12(21)14-5-6-15-13-4-7-17-20(3,11-9-18(22)23-17)16(13)8-10-19(14,15)2/h13-17H,4-11H2,1-3H3
charge 0 multiplicity 1
53 atoms
O  -4.317636 0.830459 0.019424
O  5.637627 -0.230979 -0.831615
O  -6.338256 -0.222894 0.057647
C  1.477258 0.972628 0.37349
C  2.347685 -0.244839 -0.086381
C  0.036225 0.94401 -0.178438
C  -0.649129 -0.382547 0.296145
C  -2.148567 -0.482869 -0.173636
C  1.665795 -1.539829 0.418673
C  0.196892 -1.631346 -0.077267
C  3.71131 0.143011 0.627406
C  2.375493 2.201202 0.09641
C  -0.774194 2.18569 0.271915
C  -2.855068 0.79684 0.353921
C  3.821946 1.688847 0.41096
C  -2.257147 2.106275 -0.158953
C  2.55356 -0.299023 -1.623637
C  -2.874106 -1.665452 0.530726
C  -2.274779 -0.618893 -1.714418
C  4.928597 -0.638905 0.129616
C  -4.387722 -1.686768 0.215177
C  -5.097105 -0.330509 0.124531
C  5.256462 -1.942229 0.850076
H  1.387789 0.881093 1.4821
H  0.080029 0.953457 -1.287447
H  -0.673211 -0.331485 1.411864
H  1.67596 -1.548585 1.529626
H  2.215362 -2.440632 0.079745
H  0.190245 -1.772198 -1.174816
H  -0.262959 -2.538806 0.357714
H  3.576605 -0.086163 1.704972
H  2.100228 3.07043 0.719332
H  2.289057 2.518209 -0.96035
H  -0.315251 3.102892 -0.141273
H  -0.717039 2.273552 1.378268
H  -2.794656 0.78479 1.464551
H  4.519264 1.891561 -0.420191
H  4.237639 2.173582 1.312285
H  -2.832507 2.95489 0.253258
H  -2.35009 2.155004 -1.259747
H  3.12206 -1.203888 -1.906211
H  1.594064 -0.329028 -2.167311
H  3.127513 0.56661 -1.994192
H  -2.721257 -1.570408 1.625174
H  -2.43625 -2.634525 0.229571
H  -1.99691 -1.637233 -2.040859
H  -3.30827 -0.428177 -2.053211
H  -1.623716 0.092538 -2.250281
H  -4.945529 -2.292958 0.950856
H  -4.568225 -2.16894 -0.765627
H  5.676989 -1.711559 1.849063
H  4.347481 -2.547444 1.018873
H  5.999345 -2.521463 0.279592
